*HEADING
 TIE C3D8T ELEMENT TO A ANALYTICAL RIGID SURFACE IN
 A COUPLED THERMAL-STRESS ANALYSIS
 FILE NAME: XTIE_XPL_ANALYT_RIGID_COUPLE
*NODE,NSET=BAR
*NSET,NSET=LEFT
*ELEMENT,TYPE=C3D8RT,ELSET=ROD
*SOLID SECTION,ELSET=ROD,MATERIAL=A1
1.,
*MATERIAL,NAME=A1
*ELASTIC
1.E5,
*EXPANSION
1.E-5,
*CONDUCTIVITY
1.,
*DENSITY
1.,
*SPECIFIC HEAT
1.,
*NODE, NSET=WALL
*SURFACE,TYPE=CYLINDER,NAME=WALL
START,1.01, 1.3
LINE, 1.01,-0.3
*SURFACE,TYPE=ELEMENT,NAME=RIGHT
2,S4
*RIGID BODY, REFNODE=9999, ISOTHERMAL=YES, ANALYTICAL SURFACE=WALL
*TIE,NAME=TIE, POSITION TOLERANCE=.1
RIGHT,WALL
*NSET,NSET=EDGE
*BOUNDARY
EDGE,2,3
LEFT,1
WALL,1,6
*AMPLITUDE, NAME=AMP
0.0,0.0,1.0,1.0
*STEP
*DYNAMIC TEMPERATURE-DISPLACEMENT, EXPLICIT
*BOUNDARY,AMPLITUDE=AMP
LEFT,11,11,400.
WALL,11,11,200.
*OUTPUT,FIELD,NUMBER=5
*ELEMENT OUTPUT,ELSET=ROD
S,
*NODE OUTPUT, NSET=BAR
U,NT
**FILE OUTPUT,NUM=1
***NODE FILE
**U,
**NT,
***EL FILE,ELSET=ROD
**S,
**OUTPUT, HISTORY,FREQ=1
***NODE OUTPUT, NSET=BAR
**U,NT
***NODE OUTPUT,NSET=WALL
**U,
***ENERGY OUTPUT
**ALLIE,ALLKE,ALLAE,ALLWK,ETOTAL,ALLIHE,ALLHF
*END STEP