*HEADING
  THREE-DIMENSIONAL COUPLED TEMPERATURE-DISPLACEMENT ANALYSIS
  WITH TIE CONSTRAINT TO TIE SHELL ELEMENTS
  File name: xtie_cax3t
*NODE,NSET=NALL
*ELEMENT,TYPE=CAX3T,ELSET=MS
*ELEMENT,TYPE=CAX3T,ELSET=SS
*SOLID SECTION,ELSET=MS,MATERIAL=A
1.0
*SOLID SECTION,ELSET=SS,MATERIAL=A
1.0
*MATERIAL,NAME=A
*ELASTIC
30.E6,0.3
*EXPANSION
10.E-6,
*CONDUCTIVITY
43.0
*DENSITY
7700.
*SPECIFIC HEAT
600.
*NSET,NSET=BOT
*NSET,NSET=TOP
*SURFACE,NAME=MASTER
3,S1
*SURFACE,NAME=SLAVE
11,S1
*TIE,NAME=TIE,POSITION TOLERANCE=0.5,adjust=no
SLAVE,MASTER
*STEP
*COUPLED TEMPERATURE-DISPLACEMENT,STEADY STATE
*NODE FILE
 NT,
*NODE PRINT
 NT,
*EL PRINT
 S,
 E,
*BOUNDARY
**NALL,1,2,0.0
1 ,1,2,0.0
6 ,2,,0.0
4 ,1,,0.0
BOT,11,,100.0
TOP,11,,500.0
*ENDSTEP