*HEADING
*HEADING
 TIE TWO CTD SOLID PARTS TOGETHER
 File name: xtie_c3d4t
*NODE,NSET=NALL
*ELEMENT,TYPE=C3D4T,ELSET=EALLMS
*SOLID SECTION, ELSET=EALLMS,MATERIAL=AL
*MATERIAL,NAME=AL
*ELASTIC
30.E6,0.3
*EXPANSION
10.E-6,
*CONDUCTIVITY
43.0
*DENSITY
7700.
*SPECIFIC HEAT
600.
**
*SURFACE,NAME=SST3D
301,S3
*SURFACE,NAME=MST3D
302,S4
*TIE,NAME=TIE1,POSITION TOLERANCE=1.0,adjust=no
SST3D,MST3D
*STEP
*COUPLED TEMPERATURE-DISPLACEMENT,STEADY STATE
*NODE FILE
 NT,
*NODE PRINT
 NT,
*EL PRINT
 S,
 E,
*BOUNDARY
1201 ,1,3,0.0
1206 ,1,3,0.1
1201 ,11,,100.
1206 ,11,,500.
*OUTPUT, FIELD
*ELEMENT OUTPUT
 S,E
*NODE OUTPUT
 NT
*ENDSTEP