*HEADING
XTC3D10MS: CHECKING FOR MIDSIDE NODE TEMPERATURE INTERPOLATION [C3D10M]
***
*** Heat transfer run uses first-order elements (run xtdc3d4h.inp).
*** Second order (modified) elements are used in this input deck.
***
*RESTART,WRITE
*NODE, NSET=NALL
**
**
**
*ELEMENT,TYPE=C3D10M,ELSET=ALL_ELEMENTS
*SOLID SECTION,MATERIAL=A1, ELSET=ALL_ELEMENTS
*MATERIAL,NAME=A1
*ELASTIC
1.0E06, 0.3
*EXPANSION
1.0E-05,
*DENSITY
 82.9,
*NSET, NSET=FIX1
*NSET, NSET=FIX2
*BOUNDARY
FIX1,1,1
FIX2,2,2
*INITIAL CONDITIONS,TYPE=TEMPERATURE,INTERPOLATE,FILE=xtdc3d4h.odb,STEP=1,INC=0
*STEP
*DYNAMIC, EXPLICIT
, 1.00
*TEMPERATURE, FILE=xtdc3d4h.odb,INTERPOLATE
*FILE OUTPUT,NUMBER INTERVAL=1
*EL FILE
 S,
 TEMP,
*NODE FILE
 U
*OUTPUT, FIELD, NUMBER=4
*NODE OUTPUT, NSET=NALL
U,
*ELEMENT OUTPUT, ELSET=ALL_ELEMENTS
TEMP,
*END STEP