*HEADING
 Transfer from Explicit to Standard : Test for SAX1 element
 - Explicit analysis
 - Plastic material with combined hardening (multiple backstresses)
*NODE,NSET=ALL
*NSET,NSET=SIDE
*ELEMENT,TYPE=SAX1, ELSET=SHELL
*SHELL SECTION, ELSET=SHELL, MATERIAL=STEEL
 0.002,
*MATERIAL, NAME=STEEL
*ELASTIC
 200.E3, 0.3
*PLASTIC, HARDENING=COMBINED, DATA TYPE=PARAMETERS, NUMBERBACK=3
 200., 1.111E4, 34.65, 5.555E3, 34.65, 5.555E3, 34.65
*CYCLIC HARDENING, PARAMETERS
*DENSITY
 1000.,
*BOUNDARY
 1, 1,2
 1, 6,6
 2, 2,2
 2, 6,6
*RESTART,TIMEMARKS=NO,WRITE,NUMBER=2
**
**
*ELSET,ELSET=QA_TEST_ALLELEMS
SHELL,
**
*NSET, NSET=QA_TEST_ALLNODES
ALL, SIDE
**
*STEP,NLGEOM=YES
*DYNAMIC,EXPLICIT
 , 0.1
*BOUNDARY,TYPE=VELOCITY
 2, 1, 1, 0.08
*FILE OUTPUT,TIMEMARKS=YES, NUM=1
*EL FILE
 S,LE
 STH,
 PEEQ,PE
 ALPHA
*NODE FILE
 U,
 COORD,
*OUTPUT, FIELD, TIMEMARKS=YES, NUMBER INTERVAL=1
*ELEMENT OUTPUT, ELSET=QA_TEST_ALLELEMS
 S,LE
 STH,
 PEEQ,PE
 ALPHA
*NODE OUTPUT, NSET=QA_TEST_ALLNODES
 U,
 COORD,
*OUTPUT,FIELD,VARIABLE=PRESELECT
*OUTPUT,HISTORY,VARIABLE=PRESELECT,TIMEINT=0.1
***OUTPUT,HISTORY,VARIABLE=PRESELECT
*END STEP