**
** test import of ductile damage evolution (type=disp,soft=lin)
** Explicit to Standard
**
*HEADING
 ductile failure with Mises plasticity
*restart,write,num=10
*NODE,NSET=NALL-1
*nset,nset=x0
*nset,nset=x1
*nset,nset=y0
*ELEMENT,TYPE=CPS4R,ELSET=SOLID-1
*elset,elset=alle
*elset,elset=solid
***************************************
*SOLID SECTION,MATERIAL=MAT_MISES,ELSET=SOLID-1
1.0
***************************************
*MATERIAL,NAME=MAT_MISES
*Density
2000
*Elastic
20.E+010,	0.33
*plastic
2.e8,0.0
6.e8,2.0
*Damage Initiation, Criterion = Ductile
 1.8,   -0.5,
 1.5,   -0.1,
 1.0, 	 0.0,
0.90,    0.1,
0.80,    0.3,
0.50,    0.6,
0.30,    1.0,
*damage evolution, type=disp,soft=linear
 1.0
**--------------------------------
*STEP
*dynamic,explicit
 ,0.4
*BOUNDARY,TYPE=DISPLACEMENT
 y0,2,2
 x0,1,1
*boundary, type=velocity
 x1,1,1, 2.5
**
*OUTPUT,FIELD,freq=10
*ELEMENT OUTPUT
 STATUS,SDEG,DMICRT
 PEEQ,S,PE
*NODE OUTPUT
 U,
*OUTPUT,HISTORY
*ELEMENT OUTPUT,ELSET=alle
 STATUS,SDEG,DMICRT
 PEEQ,LEP,SP,MISES,PRESS,TRIAX
*END STEP