*HEADING
 Transfer from Explicit to Standard : Test for CPS4R element
 - Explicit analysis
 - loading in shear
*NODE,NSET=ALL
*NSET,NSET=SIDE
*ELEMENT, TYPE=CPS4R, ELSET=SHELL
*SOLID SECTION, ELSET=SHELL, MATERIAL=STEEL
 0.002,
*MATERIAL,NAME=STEEL
*ELASTIC
 200.E9, 0.3
*DENSITY
 1000.,
*BOUNDARY
 1, 1,2
 2, 1,2
 3, 2,2
 4, 2,2
*RESTART,TIMEMARKS=NO,NUM=2,WRITE
**
**
*ELSET,ELSET=QA_TEST_ALLELEMS
SHELL,
**
*NSET, NSET=QA_TEST_ALLNODES
ALL, SIDE
**
*STEP
*DYNAMIC,EXPLICIT
 , 0.1
*BOUNDARY, TYPE=VELOCITY
 3, 1, 1, 2.
 4, 1, 1, 2.
***OUTPUT,HISTORY,TIME INTERVAL=0.0
***NODE OUTPUT,NSET=SIDE
**U,V,A
***ELEMENT OUTPUT,ELSET=SHELL
**S,
***ENERGY OUTPUT
**ALLKE,ALLSE,ALLWK,ALLIE,ETOTAL
*FILE OUTPUT,TIMEMARKS=YES, NUM=1
*EL FILE
 S,LE
 STH,
 PEEQ,PE
*NODE FILE
 U,
 COORD,
*OUTPUT, FIELD, TIMEMARKS=YES, NUMBER INTERVAL=1
*ELEMENT OUTPUT, ELSET=QA_TEST_ALLELEMS
 S,LE
 STH,
 PEEQ,PE
*NODE OUTPUT, NSET=QA_TEST_ALLNODES
 U,
 COORD,
*OUTPUT,FIELD,VARIABLE=PRESELECT
*OUTPUT,HISTORY,VARIABLE=PRESELECT,TIMEINT=0.1
*END STEP