*HEADING
 Transfer from Explicit to Standard : Test for CPS4R element
 - Explicit analysis
 - loading in shear
 - with orientation
*NODE,NSET=ALL
*NSET,NSET=SIDE
*ORIENTATION,NAME=ORIE
*ELEMENT, TYPE=CPS4R, ELSET=SHELL
*SOLID SECTION, ELSET=SHELL, MATERIAL=STEEL,ORIENTATION=ORIE
*MATERIAL,NAME=STEEL
*ELASTIC, TYPE=ENGINEERING CONSTANTS
2.0E11, 1.0E11, 1.0E11, 0.3,0.23,0.34, 7.69E10, 7.69E10
9.0E9,
*DENSITY
7850.0,
*BOUNDARY
 1, 1,2
 2, 1,2
 3, 2,2
 4, 2,2
*RESTART,TIMEMARKS=NO,NUM=2,WRITE
**
*ELSET,ELSET=QA_TEST_All_ELSETS_AUTO
SHELL, SHELL,
*NSET,NSET=QA_TEST_All_NSETS_AUTO
ALL, SIDE,
*STEP
*DYNAMIC,EXPLICIT
 , 0.1
*BOUNDARY, TYPE=VELOCITY
 3, 1, 1, 2.
 4, 1, 1, 2.
***OUTPUT,HISTORY,TIME INTERVAL=0.0
***NODE OUTPUT,NSET=SIDE
**U,V,A
***ELEMENT OUTPUT,ELSET=SHELL
**S,
***ENERGY OUTPUT
**ALLKE,ALLSE,ALLWK,ALLIE,ETOTAL
*FILE OUTPUT,TIMEMARKS=YES, NUM=1
*EL FILE
S,
LE,
*NODE FILE
 U,
*OUTPUT,FIELD,VARIABLE=PRESELECT,NUMBER INTERVAL=4,OP=NEW
*OUTPUT,HISTORY,VARIABLE=PRESELECT,TIME INTERVAL=0.025,OP=NEW
*OUTPUT, FIELD,TIMEMARKS=YES, NUM=1
*ELEMENT OUTPUT,ELSET=QA_TEST_All_ELSETS_AUTO
S,
LE,
*NODE OUTPUT,NSET=QA_TEST_All_NSETS_AUTO
 U,
*END STEP