*HEADING
 Transfer from Explicit to Standard : Test for CPE4RT element
 - Explicit analysis
*NODE,NSET=ALL
*NSET,NSET=SIDE
*ELEMENT, TYPE=CPE4RT, ELSET=SHELL
*SOLID SECTION, ELSET=SHELL, MATERIAL=STEEL
*MATERIAL,NAME=STEEL
*ELASTIC
 200.E9, 0.3
*DENSITY
 1000.,
*CONDUCTIVITY
1.713,
*SPECIFIC HEAT
0.4
*BOUNDARY
 1, 1,2
 2, 1,2
 3, 2,2
 4, 2,2
*INITIAL CONDITIONS, TYPE=TEMPERATURE
ALL,20.0
*RESTART,TIMEMARKS=NO,NUM=2,WRITE
**
**
*ELSET,ELSET=QA_TEST_ALLELEMS
SHELL,
**
*NSET, NSET=QA_TEST_ALLNODES
ALL, SIDE
**
*STEP
*DYNAMIC TEMPERATURE-DISPLACEMENT, EXPLICIT
*BOUNDARY, TYPE=VELOCITY
 3, 1, 1, 2.
 4, 1, 1, 2.
*CFLUX
1,,1.0
2,,1.0
*FILE OUTPUT,TIMEMARKS=YES, NUM=1
*EL FILE
 S,LE
*NODE FILE
 U,COORD
 NT,
*OUTPUT, FIELD, TIMEMARKS=YES, NUMBER INTERVAL=1
*ELEMENT OUTPUT, ELSET=QA_TEST_ALLELEMS
 S,LE
*NODE OUTPUT, NSET=QA_TEST_ALLNODES
 U,
 COORD,
*OUTPUT,FIELD,VARIABLE=PRESELECT
*OUTPUT,HISTORY,VARIABLE=PRESELECT,TIMEINT=0.1
*END STEP