*HEADING
 Transfer from Explicit to Standard : Test for C3D6 element
 - Explicit analysis
 - Plastic material with combined hardening
*NODE,NSET=ALL
*NSET,NSET=SIDE
*ELEMENT, TYPE=C3D4, ELSET=SHELL
*SOLID SECTION, ELSET=SHELL, MATERIAL=STEEL
*MATERIAL,NAME=STEEL
*ELASTIC
 200.E3, 0.3
*DENSITY
 1000.,
*PLASTIC, HARDENING=COMBINED, DATA TYPE=PARAMETERS
 200., 2.222E4, 34.65
*CYCLIC HARDENING, PARAMETERS
*BOUNDARY
 1, 1,2
 2, 2,2
 3, 1,1
 5, 1,3
 6, 2,3
 7, 1,1
7,3,3
 8, 3,3
*RESTART,TIMEMARKS=NO,NUM=2,WRITE
**
*ELSET,ELSET=QA_TEST_All_ELSETS_AUTO
SHELL, SHELL,
*NSET,NSET=QA_TEST_All_NSETS_AUTO
ALL, SIDE,
*STEP,NLGEOM=YES
*DYNAMIC,EXPLICIT
 , 0.1
*BOUNDARY, TYPE=VELOCITY
2,1,1,0.08
4,1,1,0.08
6,1,1,0.08
8,1,1,0.08
***OUTPUT,HISTORY,TIME INTERVAL=0.0
***NODE OUTPUT,NSET=SIDE
**U,V,A
***ELEMENT OUTPUT,ELSET=SHELL
**S,
***ENERGY OUTPUT
**ALLKE,ALLSE,ALLWK,ALLIE,ETOTAL
*FILE OUTPUT,TIMEMARKS=YES, NUM=1
*EL FILE
 S,LE
 PEEQ,PE
 ALPHA
*NODE FILE
 U,
 COORD,
*OUTPUT,FIELD,VARIABLE=PRESELECT,NUMBER INTERVAL=4,OP=NEW
*OUTPUT,HISTORY,VARIABLE=PRESELECT,TIME INTERVAL=0.025,OP=NEW
*OUTPUT, FIELD,TIMEMARKS=YES, NUM=1
*ELEMENT OUTPUT,ELSET=QA_TEST_All_ELSETS_AUTO
 S,LE
 PEEQ,PE
 ALPHA
*NODE OUTPUT,NSET=QA_TEST_All_NSETS_AUTO
 U,
 COORD,
*END STEP