*HEADING
 Transfer from Explicit to Standard : Test for C3D10M element
 - Explicit analysis
 - Plastic
*NODE,NSET=ALL
*ELEMENT, TYPE=C3D10M, ELSET=EALL
*SOLID SECTION, ELSET=EALL, MATERIAL=STEEL
*MATERIAL,NAME=STEEL
*ELASTIC
 200.E3, 0.3
*PLASTIC
200.0,0.0
220.0,0.001
*DENSITY
 1000.,
*BOUNDARY
 1, 1,3
 2, 2,3
 3, 3,3
 4, 1,1
 4, 3,3
 5, 1,2
 6, 2,2
 8, 1,1
*RESTART,TIMEMARKS=NO,NUM=2,WRITE
**
**
*ELSET,ELSET=QA_TEST_ALLELEMS
EALL,
**
*NSET, NSET=QA_TEST_ALLNODES
ALL,
**
*STEP
*DYNAMIC,EXPLICIT
 , 0.1
*BOUNDARY, TYPE=VELOCITY
 2, 1, 1, 0.08
 3, 1, 1, 0.08
 6, 1, 1, 0.08
 7, 1, 1, 0.08
10, 1, 1, 0.08
14, 1, 1, 0.08
18, 1, 1, 0.08
19, 1, 1, 0.08
***OUTPUT,HISTORY,TIME INTERVAL=0.0
***NODE OUTPUT,NSET=SIDE
**U,V,A
***ELEMENT OUTPUT,ELSET=SHELL
**S,
***ENERGY OUTPUT
**ALLKE,ALLSE,ALLWK,ALLIE,ETOTAL
*FILE OUTPUT,TIMEMARKS=YES, NUM=1
*EL FILE
 S,LE
 PEEQ,PE
*NODE FILE
 U,
 COORD,
*OUTPUT, FIELD, TIMEMARKS=YES, NUMBER INTERVAL=1
*ELEMENT OUTPUT, ELSET=QA_TEST_ALLELEMS
 S,LE
 PEEQ,PE
*NODE OUTPUT, NSET=QA_TEST_ALLNODES
 U,
 COORD,
*OUTPUT,FIELD,VARIABLE=PRESELECT
*OUTPUT,HISTORY,VARIABLE=PRESELECT,TIMEINT=0.1
*END STEP