*HEADING
 Transfer from Explicit to Standard : Test for M3D4 element
 - Springback analysis
 - tension test
*IMPORT,STEP=1,INT=2,UPDATE=NO,STATE=YES
 SHELL,
*MATERIAL,NAME=STEEL
*ELASTIC
 200.E9, 0.3
*DENSITY
 1000.,
*BOUNDARY
 1, 3,3
 2, 3,3
 3, 3,3
 4, 3,3
 1, 1,2
 2, 2,2
 3, 1,1
*RESTART, WRITE, FREQ=100
**
*STEP,NLGEOM,INC=50
*STATIC
 0.1, 1.
*CONTROLS,PARAMETERS=FIELD,FIELD=GLOBAL
1.0E-4,,,1.
*OUTPUT,HISTORY,VARIABLE=PRESELECT
*OUTPUT,FIELD
*NODE OUTPUT
U,
*ELEMENT OUTPUT
S,LE,PE,
STH,
*END STEP