*HEADING
 Transfer from Explict to Standard:
 Test import capability for *TRANSFORM, TYPE=R
 Results imported from: sx_x_cpe4r_rtrans.inp
*IMPORT,STEP=3,INT=1,UPDATE=NO,STATE=YES
 EALL,
*MATERIAL,NAME=MAT1
*ELASTIC
2.0E9,0.3
*TRANSFORM, NSET=TRANS, TYPE=R
**TRANSFORM, NSET=NALL, TYPE=R
*RESTART,WRITE
**
*STEP,NLGEOM
*STATIC
0.1,1.
*BOUNDARY
XMOVE, 1,1 ,1.5
YFIX, 2, 2
XFIX, 1, 1
*NODE PRINT, FREQ=99
U,
RF,
*EL PRINT, FREQ=99
E, S
*END STEP