*HEADING
 Transfer from Explicit to Standard : Test for CPE3 element
 - Springback analysis
 - shear test
*IMPORT,STEP=1,INT=2,UPDATE=YES,STATE=YES
 SHELL,
*IMPORT NSET
 ALL,
*MATERIAL,NAME=STEEL
*ELASTIC
 200.E9, 0.3
*DENSITY
 1000.,
*NSET,NSET=all
*BOUNDARY
 1, 1,2
 2, 1,2
 3, 2,2
 4, 2,2
*RESTART, WRITE, FREQ=100
**
*STEP,NLGEOM,INC=50
*STATIC
 0.1, 1.
*CONTROLS, PARAMETERS=FIELD, FIELD=DISPLACEMENT
 1.e-3,,,,
*PRINT,FREQ=1
*EL PRINT, FREQ=100
 S,
 E,
 PEEQ,
*NODE PRINT, FREQ=100
 U,
 COORD,
 RF,
*END STEP