*HEADING
 Transfer from Explicit to Standard : Test for CAX4R element
 - Springback analysis
 - tension test
*IMPORT,STEP=1,INT=2,UPDATE=NO,STATE=NO
 SHELL,
*IMPORT NSET
 ALL,
*MATERIAL,NAME=STEEL
*ELASTIC
 200.E9, 0.3
*DENSITY
 1000.,
*BOUNDARY
 1, 1,2
 2, 2,2
 3, 1,1
*RESTART, WRITE, FREQ=100
**
*STEP,NLGEOM,INC=50
*STATIC
 0.1, 1.
*CONTROLS, PARAMETERS=FIELD, FIELD=DISPLACEMENT
 1.e-4,,,10.,
*PRINT,FREQ=1
*EL PRINT, FREQ=100
 E,
 PEEQ,
*NODE PRINT, FREQ=100
 U,
 COORD,
 RF,
*OUTPUT,FIELD
*ELEMENT OUTPUT
EE,
PE,
*NODE OUTPUT
COORD,
*END STEP