*HEADING
 Transfer from Explicit to Standard : Plasticity Test for C3D6 element
 - Standard Analysis
 - Plastic material
*IMPORT,STEP=1,INT=2,UPDATE=NO,STATE=YES
 SHELL,
*IMPORT NSET
 ALL,
*MATERIAL,NAME=STEEL
*ELASTIC
 200.E3, 0.3
*PLASTIC
200.0, 0.000
220.0, 0.001
*DENSITY
 1000.,
*RESTART, WRITE, FREQ=100
**
**
*NSET, NSET=QA_TEST_ALLNODES
ALL,
**
*STEP,NLGEOM,INC=50
*STATIC
 0.1, 1.
*BOUNDARY
 1, 1,2
 2, 2,2
 3, 1,1
 5, 1,3
 6, 2,3
 7, 1,1
7,3,3
 8, 3,3
*PRINT,FREQ=1
*EL PRINT
 PEEQ,
 MISES,
*NODE PRINT
 U,
 COORD,
 RF,
*OUTPUT,FIELD,VARIABLE=PRESELECT,FREQUENCY=100
*OUTPUT,FIELD
*NODE OUTPUT
 U,COORD
*OUTPUT,HISTORY
*NODE OUTPUT, NSET=QA_TEST_ALLNODES
 U,COORD
*END STEP