*HEADING
INFINITELY EXTENDING 3D ARRAY OF CUBES, DC2D4, 2 PER SYMM (NR=5,4)
*PREPRINT
*PHYSICAL CONSTANTS, STEFAN=5.669E-8,ABSOLUTE ZERO=0.0
*NODE
*NGEN,NSET=LEFT_HAND_SIDE
*NGEN,NSET=RIGHT_HAND_SIDE
*NFILL,NSET=ALL_NODES
LEFT_HAND_SIDE,RIGHT_HAND_SIDE,17
*NSET,NSET=LOWER_LEFT_HAND_SIDE,GEN
*NSET,NSET=UPPER_RIGHT_HAND_SIDE,GEN
*NSET,NSET=OUTPUT_NODES,GEN
*ELEMENT,TYPE=DC2D4,ELSET=CONDUCTION_ELEMENTS
*ELSET,ELSET=OUTPUT_ELEMENTS,GEN
*SOLID SECTION,ELSET=CONDUCTION_ELEMENTS,MATERIAL=ALUMINUM
*MATERIAL,NAME=ALUMINUM
*CONDUCTIVITY
204.,
*DENSITY
2707.,
*SPECIFIC HEAT
896.,
***  CAVITY DEFINITION
*surface,NAME=ALL_SURFACES,PROPERTY=PROPERTY_FOR_ALL_SURFACES
CONDUCTION_ELEMENTS,S1
CONDUCTION_ELEMENTS,S2
CONDUCTION_ELEMENTS,S3
CONDUCTION_ELEMENTS,S4
*CAVITY DEFINITION,NAME=2D_CAVITY,AMB=200.
ALL_SURFACES,
*SURFACE PROPERTY,NAME=PROPERTY_FOR_ALL_SURFACES
*EMISSIVITY
***
*INITIAL CONDITIONS,TYPE=TEMPERATURE
ALL_NODES,300.
*RESTART,WRITE,FREQ=10
*STEP,INC=20
*HEAT TRANSFER,STEADY STATE
1.,1.
*BOUNDARY
LOWER_LEFT_HAND_SIDE,11,,1000.
UPPER_RIGHT_HAND_SIDE,11,,400.
*RADIATION VIEW,REFLECTION=NO,SYMM=XY_PERIODIC
*RADIATION SYMMETRY,NAME=XY_PERIODIC
*PERIODIC,NR=5,TYPE=2D
*PERIODIC,NR=4,TYPE=2D
*NODE PRINT,NSET=OUTPUT_NODES
NT,
*NODE FILE,NSET=OUTPUT_NODES
NT,
*RADIATION PRINT
RADFL,VFTOT,FTEMP
*RADIATION FILE,ELSET=OUTPUT_ELEMENTS
RADFL,VFTOT,FTEMP
*VIEWFACTOR OUTPUT,CAVITY=2D_CAVITY
*OUTPUT,FIELD
*NODE OUTPUT,NSET=OUTPUT_NODES
NT,
*RADIATION OUTPUT,ELSET=OUTPUT_ELEMENTS
RADFL,VFTOT,FTEMP
*END STEP