*HEADING
 Verification for meshed general section
 I-section with node offset
*PREPRINT,ECHO=YES,MODEL=YES,HISTORY=YES
*MATERIAL,NAME=MAT
*ELASTIC
3.E+7, 0.3
*DENSITY
7.3E-4
*PART, NAME=LINEARMESHED
*NODE
*NGEN,NSET=ALL
*ELEMENT,TYPE=B31, ELSET=EALL
*BEAM GENERAL SECTION,SECTION=MESHED,ELSET=EALL
0., 0., -1.
*INCLUDE,INPUT=meshedsect_i_offset.bsp
*END PART
*PART, NAME=LINEARGENERAL
*NODE
*NGEN,NSET=ALL
*ELEMENT,TYPE=B31, ELSET=EALL
*BEAM GENERAL SECTION,SECTION=GENERAL,DENSITY=7.3E-4,ELSET=EALL
2.26E+1,3.07358E+2,2.3711E-3,.54034333E+2,9.99
0., 0., -1.
3.E+7, 1.1538451E+7,
*centroid
*shear center
*section points
*END PART
*PART, NAME=LINEARI
*NODE
*NGEN,NSET=ALL
*ELEMENT,TYPE=B31, ELSET=EALL
*BEAM SECTION,SECTION=I,MATERIAL=MAT,ELSET=EALL
10.,10.,8.0,5.0,1.0,1.0,1.2
0., 0., -1.
*END PART
*ASSEMBLY, NAME=ASSEMBLY
*INSTANCE,NAME=LINEARMESHED_A, PART=LINEARMESHED
*END INSTANCE
*INSTANCE,NAME=LINEARGENERAL_A, PART=LINEARGENERAL
*END INSTANCE
*INSTANCE,NAME=LINEARI_A, PART=LINEARI
*END INSTANCE
*END ASSEMBLY
*BOUNDARY
ASSEMBLY.LINEARMESHED_A.1, 1, 6
ASSEMBLY.LINEARGENERAL_A.1, 1, 6
ASSEMBLY.LINEARI_A.1, 1, 6
*NSET, NSET=QA_TEST_NALL
ASSEMBLY.LINEARMESHED_A.11
ASSEMBLY.LINEARGENERAL_A.11
ASSEMBLY.LINEARI_A.11
*ELSET, ELSET=QA_TEST_EALL
ASSEMBLY.LINEARMESHED_A.1
ASSEMBLY.LINEARGENERAL_A.1
ASSEMBLY.LINEARI_A.1
*STEP,PERT
*STATIC
*CLOAD
ASSEMBLY.LINEARMESHED_A.11,2,2.5E+5
ASSEMBLY.LINEARGENERAL_A.11,2,2.5E+5
ASSEMBLY.LINEARI_A.11,2,2.5E+5
*EL PRINT,ELSET=QA_TEST_EALL
S,
E,
*EL FILE,ELSET=QA_TEST_EALL
E,
*OUTPUT,FIELD,FREQ=1
*NODE OUTPUT, NSET=QA_TEST_NALL
U,
*ELEMENT OUTPUT,ELSET=QA_TEST_EALL
S,
*OUTPUT, HISTORY,FREQ=1
*NODE OUTPUT, NSET=QA_TEST_NALL
U,
*ELEMENT OUTPUT,ELSET=QA_TEST_EALL
S,
*END STEP