*Heading
 Pressure penetration with CCL9
** Job name: ver-ppen-ccl9 Model name: Model-1
** Generated by: Abaqus/CAE 6.10-EFR
*Preprint, echo=NO, model=NO, history=NO, contact=NO
**
** PARTS
**
*Part, name=Part-1
*End Part
**
*Part, name=Part-2
*End Part
**
**
** ASSEMBLY
**
*Assembly, name=Assembly
**
*Instance, name=Part-1-1, part=Part-1
*Node
*Element, type=CCL9
*Nset, nset=_PickedSet2, internal, generate
*Elset, elset=_PickedSet2, internal, generate
** Section: Section-1
*Solid Section, elset=_PickedSet2, material=Material-1
*End Instance
**
*Instance, name=Part-2-1, part=Part-2
*Node
*Element, type=CCL9
*Nset, nset=_PickedSet2, internal, generate
*Elset, elset=_PickedSet2, internal, generate
** Section: Section-1
*Solid Section, elset=_PickedSet2, material=Material-1
*End Instance
**
*Nset, nset=_PickedSet11, internal, instance=Part-1-1
*Nset, nset=_PickedSet11, internal, instance=Part-2-1
*Elset, elset=_PickedSet11, internal, instance=Part-1-1
*Elset, elset=_PickedSet11, internal, instance=Part-2-1
*Nset, nset=_PickedSet12, internal, instance=Part-1-1
*Nset, nset=_PickedSet12, internal, instance=Part-2-1
*Elset, elset=_PickedSet12, internal, instance=Part-1-1, generate
*Elset, elset=_PickedSet12, internal, instance=Part-2-1
*Nset, nset=_PickedSet13, internal, instance=Part-1-1
*Elset, elset=_PickedSet13, internal, instance=Part-1-1
*Nset, nset=_PickedSet14, internal, instance=Part-2-1
*Elset, elset=_PickedSet14, internal, instance=Part-2-1
*Nset, nset=_PickedSet18, internal, instance=Part-2-1
*Nset, nset=_PickedSet19, internal, instance=Part-1-1
*Nset, nset=_PickedSet20, internal, instance=Part-1-1
*Elset, elset=__PickedSurf15_S4, internal, instance=Part-2-1
*Surface, type=ELEMENT, name=_PickedSurf15, internal
__PickedSurf15_S4, S4
*Elset, elset=__PickedSurf16_S5, internal, instance=Part-1-1, generate
*Elset, elset=__PickedSurf16_S4, internal, instance=Part-1-1, generate
*Elset, elset=__PickedSurf16_S3, internal, instance=Part-1-1, generate
*Surface, type=ELEMENT, name=_PickedSurf16, internal
__PickedSurf16_S5, S5
__PickedSurf16_S4, S4
__PickedSurf16_S3, S3
*End Assembly
**
** MATERIALS
**
*Material, name=Material-1
*Elastic
100000., 0.3
**
** INTERACTION PROPERTIES
**
*Surface Interaction, name=IntProp-1
1.,
**
** BOUNDARY CONDITIONS
**
** Name: BC-1 Type: Symmetry/Antisymmetry/Encastre
*Boundary
_PickedSet11, XSYMM
** Name: BC-2 Type: Symmetry/Antisymmetry/Encastre
*Boundary
_PickedSet12, ZSYMM
** Name: BC-3 Type: Displacement/Rotation
*Boundary
_PickedSet13, 1, 1
_PickedSet13, 2, 2
_PickedSet13, 3, 3
** Name: BC-4 Type: Displacement/Rotation
*Boundary
_PickedSet14, 1, 1
_PickedSet14, 2, 2
_PickedSet14, 3, 3
**
** INTERACTIONS
**
** Interaction: Int-1
*Contact Pair, interaction=IntProp-1, small sliding
_PickedSurf16, _PickedSurf15
** ----------------------------------------------------------------
**
** STEP: Step-1
**
*Step, name=Step-1
Shrink fit
*Static
1., 1., 1e-05, 1.
*contact interference, shrink
_PickedSurf16, _PickedSurf15
**
** OUTPUT REQUESTS
**
**Restart, write, frequency=0
**
** FIELD OUTPUT: F-Output-1
**
*Output, field
*Node Output
U,
*Element Output, directions=YES
S,
*Contact Output
CDISP, CSTRESS, PPRESS
*Output, history, frequency=0
*End Step
** ----------------------------------------------------------------
**
** STEP: Step-2
**
*Step, name=Step-2
Pressure penetration
*Static
0.01, 1., 1e-05, 0.05
**
** INTERACTIONS
**
** Interaction: Int-2
*Pressure Penetration, master=_PickedSurf15, slave=_PickedSurf16, penetration time=0.001
_PickedSet19, _PickedSet18, 20000., 0.
*Pressure Penetration, master=_PickedSurf15, slave=_PickedSurf16, penetration time=0.001
_PickedSet20, , 20000., 0.
**
** OUTPUT REQUESTS
**
*Restart, write, frequency=0
**
** FIELD OUTPUT: F-Output-1
**
*Output, field
*Node Output
U,
*Element Output, directions=YES
S,
*Contact Output
CDISP, CSTRESS, PPRESS
*Output, history, frequency=0
*End Step