*HEADING
 TEST FOR TAPERED SHELLS USING SHELL GENERAL SECTION [SC8R]
*PREPRINT,ECHO=YES,HISTORY=YES,MODEL=YES
*NODE,NSET=BOTTOM
*NODE,NSET=TOP
*NFILL,NSET=NALL
 BOTTOM,TOP,10,10
*ELEMENT, TYPE=SC8R
*ELGEN, ELSET=EALL
*SHELL GENERAL SECTION, MATERIAL=A1, ELSET=EALL
 1.0
*MATERIAL, NAME=A1
*ELASTIC, TYPE=ISOTROPIC
 10.E9,
*DENSITY
 8000.,
*BOUNDARY
 BOTTOM,1,3
*ELSET,ELSET=QA_TEST_ALLELEMS
 EALL,
*NSET, NSET=QA_TEST_ALLNODES
 BOTTOM, TOP, NALL
*STEP
*STATIC
 ,10.0
*CLOAD
 101, 2, 15.
1101, 2,-15.
 102, 2, 30.
1102, 2,-30.
 103, 2, 15.
1103, 2,-15.
*EL PRINT
 S,
 STH,
 SF,
*NODE PRINT
 U,
 RF,
*OUTPUT, FIELD
*ELEMENT OUTPUT, ELSET=QA_TEST_ALLELEMS
 S,
 STH,
*NODE OUTPUT, NSET=QA_TEST_ALLNODES
 U,
*END STEP