*HEADING
 TEST OF USER OUTPUT VARIABLES - TEMP GRADIENT TEST, B31 ---
*RESTART,WRITE,FREQ=5
*NODE,NSET=ALL
*ELEMENT,TYPE=B31, ELSET=EALL
*BEAM SECTION,SECTION=RECT, TEMP=GRADIENTS,MATERIAL=SEL3, ELSET=EALL
2.,3.
*MATERIAL,NAME=SEL3
*ELASTIC
 3.E6, 0.3
*DENSITY
 0.16667,
*EXPANSION
 .0001,
*USER OUTPUT VARIABLES
*INITIAL CONDITIONS,TYPE=TEMPERATURE
 ALL, -10., 0.
*BOUNDARY
1,1,6
*STEP,NLGEOM
*STATIC,DIRECT
.1,1.
*CLOAD
2, 2, 1000.
*TEMPERATURE,OP=NEW
 ALL, 10., 20., 30.
*EL PRINT,FREQ=5,SUMMARY=NO
UVARM1,UVARM2
S,
*EL PRINT,FREQ=5,SUMMARY=NO
UVARM3,UVARM4
E,
*EL PRINT,FREQ=5,SUMMARY=NO
UVARM5,
IVOL,
*EL PRINT,FREQ=5,SUMMARY=NO
UVARM6,
TEMP,
*NODE PRINT,FREQ=0
*EL FILE,FREQ=5
UVARM,S,E,IVOL,TEMP
*END STEP