*HEADING
 TEST OF USER OUTPUT VARIABLES - DC1D2 ---
*RESTART,WRITE,FREQ=5
*NODE,NSET=ALL
*NSET,NSET=FIX1
*ELEMENT,TYPE=DC1D2, ELSET=EALL
*SOLID SECTION,MATERIAL=HFV1, ELSET=EALL
*MATERIAL,NAME=HFV1
*CONDUCTIVITY,DEP=2
3.1E-5,100., 0.,  0.
3.1E-5,200., 0.,  0.
3.1E-5,100., 1.,  0.
3.1E-5,200., 1.,  0.
3.1E-5,100., 0.,  1.
3.1E-5,200., 0.,  1.
3.1E-5,100., 1.,  1.
3.1E-5,200., 1.,  1.
*SPECIFIC HEAT
 .390,
*DENSITY
 82.9,
*USER OUTPUT VARIABLES
*INITIAL CONDITIONS,TYPE=TEMPERATURE
ALL,100.
*INITIAL CONDITIONS,TYPE=FIELD
ALL,0.25,0.5
*STEP,AMPLITUDE=RAMP,INC=10
*HEAT TRANSFER
0.1,1.0
*FIELD,VARIABLE=1
ALL,1.
*FIELD,VARIABLE=2
ALL,0.75
*BOUNDARY
 FIX1, 11,,200.
*NODE PRINT,FREQ=0
*EL PRINT,FREQ=5,SUMMARY=NO
UVARM1,
TEMP,
*EL PRINT,FREQ=5,SUMMARY=NO
UVARM2,UVARM3
HFL,
*EL PRINT,FREQ=5,SUMMARY=NO
UVARM4,UVARM5
FV ,
*EL FILE,FREQ=5
UVARM,TEMP,HFL,FV
*END STEP