*HEADING
 BASIC VERIFICATION OF USER SUBROUTINE HETVAL
 TEST TYPE: USER SUBROUTINE, TEST NAME: UHETVAL
*NODE,NSET=NALL
*ELEMENT,TYPE=DC2D4,ELSET=BLOCK
*SOLID SECTION,ELSET=BLOCK,MATERIAL=BLOCK
1.,
*MATERIAL,NAME=BLOCK
*CONDUCTIVITY
7.872E-4,
*DENSITY
0.2829,
*SPECIFIC HEAT
0.1431,
*HEAT GENERATION
*STEP,INC=10
*HEAT TRANSFER,DELTMX=55.
5.,50.
*NODE PRINT
NT,
*NODE FILE
NT,
*OUTPUT,FIELD
*NODE OUTPUT
NT,
*END STEP