*HEADING
TEST OF URDFIL FOR STATIC PROCEDURE.
*RESTART, WRITE
*NODE
*NSET, NSET=BOT
*NSET, NSET=LEFT
*NSET, NSET=RIGHT
*NSET, NSET=NOUT
*ELEMENT, TYPE=CPE4R, ELSET=SOLID
*MATERIAL, NAME=MAT1
*ELASTIC
200.E9,0.3
*SOLID SECTION, ELSET=SOLID, MATERIAL=MAT1
1.,
*BOUNDARY
BOT, 2,2,0.
LEFT, 1,1,0.
*STEP
*STATIC, DIRECT
0.1,1.
*BOUNDARY
RIGHT, 1,1,0.1
*EL PRINT, FREQ=0
*NODE PRINT, FREQ=0
*EL FILE
S,
*NODE FILE, NSET=NOUT
U,
*END STEP
*STEP
*STATIC, DIRECT
0.1,1.
*BOUNDARY
RIGHT, 1,1,0.
*END STEP
*STEP
*STATIC, DIRECT
0.1,1.
*BOUNDARY
RIGHT, 1,1,0.1
*EL FILE, FREQ=4
S,
*NODE FILE, FREQ=0
*END STEP