*HEADING
 Test for passing abaqus material to UELMAT: ss heat transfer
*RESTART,WRITE,NUMBER INTERVAL=10
*PREPRINT,MODEL=YES
*PART,NAME=part1
  *NODE,NSET=NALL
  *NSET,NSET=SOLID_BOTTOM
  *NSET,NSET=SOLID_LEFT
  *NSET,NSET=SOLID_RIGHT
  *NSET,NSET=SOLID_ALL
  *USER ELEMENT, TYPE=U1, NODES=4, COORDINATES=2,
   INTEGRATION=4,TENSOR=TWOD
  *ELEMENT,TYPE=U1,ELSET=SOLID
*END PART
*ASSEMBLY,NAME=A1
  *INSTANCE,NAME=I1,PART=PART1
  *END INSTANCE
*END ASSEMBLY
*UEL PROPERTY, ELSET=I1.SOLID, MATERIAL=MAT_THERM
**************************************
*BOUNDARY
  I1.SOLID_LEFT,11,11
***************************************
*MATERIAL,NAME=MAT_THERM
*CONDUCTIVITY
 0.03,
*SPECIFIC HEAT
 .39,
*DENSITY
 82.9,
*STEP
*HEAT TRANSFER, STEADY STATE
 0.001,0.05,,0.001
*CFLUX
 I1.SOLID_RIGHT,11,-1.0
**
**
*OUTPUT,FIELD,freq=1
*ELEMENT OUTPUT,ELSET=I1.SOLID
 HFL,
*NODE OUTPUT,NSET=I1.NALL
 NT,
*OUTPUT,HISTORY
*ELEMENT OUTPUT,ELSET=I1.SOLID
 HFL,
*NODE OUTPUT,NSET=I1.NALL
 NT11,
*END STEP