*HEADING
 TEST OF LINEAR USER ELEMENTS
*NODE,NSET=PR
*NGEN,NSET=N1
*ELEMENT,TYPE=T3D2
*ELGEN,ELSET=TRUSS
*SOLID SECTION,ELSET=TRUSS,MATERIAL=S1
0.002,
*MATERIAL,NAME=S1
*ELASTIC
2.1E11,0.3
*DENSITY
7200.,
*NODE ,NSET=PR
*NGEN,NSET=N2
*USER ELEMENT,NODES=2,TYPE=U1001,PROPERTIES=4,
COORDINATES=3,VARIABLES=12
*ELEMENT,TYPE=U1001
*ELGEN,ELSET=UTRUSS
*UEL PROPERTY,ELSET=UTRUSS
*BOUNDARY
N1,2,3
N2,2,3
1,1
101,1
*STEP, INC=30
*DYNAMIC, HAFTOL=2.5
0.0002, 0.002
*CLOAD
  6, 1, 5.
106, 1, 5.
*EL PRINT,ELSET=TRUSS,SUMMARY=NO
S,E
ELEN ,
*ENERGY PRINT
*ENERGY FILE
*NODE FILE,NSET=PR,FREQ=5
U,RF
*OUTPUT,HISTORY
*ENERGY OUTPUT,VARIABLE=PRESELECT
*OUTPUT,FIELD,FREQ=5
*NODE OUTPUT,NSET=PR
U,RF
*END STEP