*HEADING
  : *DSLOAD, *DSFLUX, *DSECURRENT, *SFILM, AND *SRADIATION FOR
  COUPLED THERMAL-ELECTRICAL-STRUCTURAL [Q3D8]
*NODE,NSET=ALL
*NSET,NSET=FIX1
*NSET,NSET=FIX2
*NSET,NSET=FIX3
*NSET,NSET=FIX4
*NSET,NSET=FIX5
*NSET,NSET=FIX6
*ELEMENT,TYPE=Q3D8, ELSET=EALL
*surface, NAME=SIDE_1
 1, S1
*surface, NAME=SIDE_2
 1, S2
*surface, NAME=SIDE_3
 1, S3
*surface, NAME=SIDE_4
 1, S4
*surface, NAME=SIDE_5
 1, S5
*surface, NAME=SIDE_6
 1, S6
*SOLID SECTION,MATERIAL=A1, ELSET=EALL
*MATERIAL,NAME=A1
*ELASTIC
 30.E6, .3
*EXPANSION
 0.,
*CONDUCTIVITY
 3.77E-5,
*ELECTRICAL CONDUCTIVITY
*JOULE HEAT FRACTION
*DENSITY
 82.9,
*SPECIFIC HEAT
 .39,
*PHYSICAL CONSTANTS, ABSOLUTE ZERO=-460., STEFAN BOLTZMANN = 5.E-8
*STEP
*COUPLED TEMPERATURE-DISPLACEMENT, STEADY STATE, EXPLICIT, ELECTRICAL
 1., 1.
*SFILM, OP=NEW
 SIDE_2, F, 75., .103
*BOUNDARY, OP=NEW
 ALL, 1,3
 FIX1, 9,9
 FIX1, 11
*EL PRINT
 LOADS,FLUXS
 FILM,RAD
 CE,
*NODE PRINT
 RF,
 NT,
 RFL,
*OUTPUT,FIELD
*NODE OUTPUT,VARIABLE=PRESELECT
 NT,
 RFL,
 EPOT,
 RECUR,
*END STEP
*STEP
*COUPLED TEMPERATURE-DISPLACEMENT,STEADY STATE,EXPLICIT, ELECTRICAL
1.,1.
*SFILM,OP=NEW
SIDE_2,F,75.,.103
*BOUNDARY,OP=NEW
ALL,1,3
FIX1,9,9
FIX1,11
*END STEP
*STEP
*COUPLED TEMPERATURE-DISPLACEMENT,STEADY STATE, EXPLICIT, ELECTRICAL
 1., 1.
*DSLOAD, OP=NEW
 SIDE_1, P, 100.
 SIDE_2, P, 200.
 SIDE_3, P, 300.
 SIDE_4, P, 400.
 SIDE_5, P, 500.
 SIDE_6, P, 600.
*SFILM,OP=NEW
 SIDE_1, F, 75., .103
*BOUNDARY,OP=NEW
 ALL, 1,3
 FIX2, 9,9
 FIX2, 11
*END STEP
*STEP
*COUPLED TEMPERATURE-DISPLACEMENT,STEADY STATE, EXPLICIT, ELECTRICAL
 1., 1.
*DSLOAD, OP=NEW
 SIDE_1, HP, 3000., 0., -7.
*SFILM,OP=NEW
 SIDE_3, F, 75., .103
*BOUNDARY,OP=NEW
 ALL, 1,3
 FIX5, 9,9
 FIX5, 11
*END STEP
*STEP
*COUPLED TEMPERATURE-DISPLACEMENT,STEADY STATE, EXPLICIT, ELECTRICAL
 1., 1.
*DSLOAD, OP=NEW
 SIDE_2, HP, 3000., 0., -7.
*SFILM,OP=NEW
 SIDE_4, F, 75., .103
*BOUNDARY,OP=NEW
 ALL, 1,3
 FIX6, 9,9
 FIX6, 11
*END STEP
*STEP
*COUPLED TEMPERATURE-DISPLACEMENT,STEADY STATE, EXPLICIT, ELECTRICAL
 1., 1.
*DSLOAD, OP=NEW
 SIDE_3, HP, 3000., 0., -7.
*SFILM,OP=NEW
 SIDE_5, F, 75., .103
*BOUNDARY,OP=NEW
 ALL, 1,3
 FIX3, 9,9
 FIX3, 11
*END STEP
*STEP
*COUPLED TEMPERATURE-DISPLACEMENT,STEADY STATE, EXPLICIT, ELECTRICAL
 1., 1.
*DSLOAD, OP=NEW
 SIDE_4, HP, 3000., 0., -7.
*SFILM,OP=NEW
 SIDE_6, F, 75., .103
*BOUNDARY,OP=NEW
 ALL, 1,3
 FIX4, 9,9
 FIX4, 11
*END STEP
*STEP
*COUPLED TEMPERATURE-DISPLACEMENT, STEADY STATE, EXPLICIT, ELECTRICAL
 1., 1.
*DSLOAD, OP=NEW
 SIDE_5, HP, 3000., 0., -7.
*SFILM, OP=NEW
*SRADIATE, OP=NEW
 SIDE_2, R, 75., 1.E-6
*BOUNDARY,OP=NEW
 ALL, 1,3
 FIX1, 9,9
 FIX1, 11
*END STEP
*STEP
*COUPLED TEMPERATURE-DISPLACEMENT, STEADY STATE, EXPLICIT, ELECTRICAL
 1., 1.
*DSLOAD, OP=NEW
 SIDE_6, HP, 3000., 0., -7.
*SRADIATE, OP=NEW
 SIDE_1, R, 75., 1.E-6
*BOUNDARY,OP=NEW
 ALL, 1,3
 FIX2,9,9
 FIX2,11
*END STEP
*STEP
*COUPLED TEMPERATURE-DISPLACEMENT, STEADY STATE, EXPLICIT, ELECTRICAL
 1., 1.
*DSLOAD, OP=NEW
*SRADIATE, OP=NEW
 SIDE_3, R, 75., 1.E-6
*BOUNDARY,OP=NEW
 ALL, 1,3
 FIX5,9,9
 FIX5,11
*END STEP
*STEP
*COUPLED TEMPERATURE-DISPLACEMENT, STEADY STATE, EXPLICIT, ELECTRICAL
 1., 1.
*SRADIATE, OP=NEW
 SIDE_4, R, 75., 1.E-6
*BOUNDARY, OP=NEW
 ALL, 1,3
 FIX6,9,9
 FIX6,11
*END STEP
*STEP
*COUPLED TEMPERATURE-DISPLACEMENT, STEADY STATE, EXPLICIT, ELECTRICAL
 1., 1.
*SRADIATE, OP=NEW
 SIDE_5, R, 75., 1.E-6
*BOUNDARY,OP=NEW
 ALL, 1,3
 FIX3,9,9
 FIX3,11
*END STEP
*STEP
*COUPLED TEMPERATURE-DISPLACEMENT, STEADY STATE, EXPLICIT, ELECTRICAL
 1., 1.
*SRADIATE, OP=NEW
 SIDE_6, R, 75., 1.E-6
*BOUNDARY, OP=NEW
 ALL, 1,3
 FIX4,9,9
 FIX4,11
*END STEP
*STEP
*COUPLED TEMPERATURE-DISPLACEMENT, STEADY STATE, EXPLICIT, ELECTRICAL
 1., 1.
*BOUNDARY, OP=NEW
 ALL, 1,3
 FIX2, 9,9
 FIX2, 11
*SRADIATE, OP=NEW
*DSFLUX, OP=NEW
 SIDE_1, S, .3
*DSECURRENT, OP=NEW
 SIDE_1, CS, .3
*END STEP
*STEP
*COUPLED TEMPERATURE-DISPLACEMENT, STEADY STATE, EXPLICIT, ELECTRICAL
 1., 1.
*BOUNDARY, OP=NEW
 ALL, 1,3
 FIX1, 9,9
 FIX1, 11
*DSFLUX,OP=NEW
 SIDE_2, S, .3
*DSECURRENT,OP=NEW
 SIDE_2, CS, .3
*END STEP
*STEP
*COUPLED TEMPERATURE-DISPLACEMENT, STEADY STATE, EXPLICIT, ELECTRICAL
 1., 1.
*BOUNDARY, OP=NEW
 ALL, 1,3
 FIX5, 9,9
 FIX5, 11
*DSFLUX,OP=NEW
 SIDE_3, S, .3
*DSECURRENT,OP=NEW
 SIDE_3, CS, .3
*END STEP
*STEP
*COUPLED TEMPERATURE-DISPLACEMENT, STEADY STATE, EXPLICIT, ELECTRICAL
 1., 1.
*BOUNDARY, OP=NEW
 ALL, 1,3
 FIX6, 9,9
 FIX6, 11
*DSFLUX,OP=NEW
 SIDE_4, S, .3
*DSECURRENT,OP=NEW
 SIDE_4, CS, .3
*END STEP
*STEP
*COUPLED TEMPERATURE-DISPLACEMENT, STEADY STATE, EXPLICIT, ELECTRICAL
 1., 1.
*BOUNDARY, OP=NEW
 ALL, 1,3
 FIX3, 9,9
 FIX3, 11
*DSFLUX,OP=NEW
 SIDE_5, S, .3
*DSECURRENT,OP=NEW
 SIDE_5, CS, .3
*END STEP
*STEP
*COUPLED TEMPERATURE-DISPLACEMENT, STEADY STATE, EXPLICIT, ELECTRICAL
 1., 1.
*BOUNDARY, OP=NEW
 ALL, 1,3
 FIX4, 9,9
 FIX4, 11
*DSFLUX,OP=NEW
 SIDE_6, S, .3
*DSECURRENT,OP=NEW
 SIDE_6, CS, .3
*END STEP