*HEADING
: COUPLED THERMAL-ELECTRICAL-STRUCTURAL CONTACT -- INTERFACE RADIATION
*RESTART,WRITE,F=2
*NODE,NSET=ALL
*NGEN
*NSET,NSET=BOT,GEN
*NSET,NSET=TOP,GEN
**
*ELEMENT,TYPE=Q3D8R,ELSET=DEAD
*SOLID SECTION,ELSET=DEAD,MATERIAL=DEAD
*MATERIAL,NAME=DEAD
*ELASTIC
30.E6,.3
*CONDUCTIVITY
10.000,
*ELECTRICAL CONDUCTIVITY
**  6.58E6,
*JOULE HEAT FRACTION
** 1.0,
*SPECIFIC HEAT
0.001,
*DENSITY
1000.,
**
*ELEMENT,TYPE=Q3D8R,ELSET=ACTIVE
*SOLID SECTION,ELSET=ACTIVE,MATERIAL=ACTIVE
*MATERIAL,NAME=ACTIVE
*ELASTIC
30.E6,.3
*CONDUCTIVITY
10.000,
*ELECTRICAL CONDUCTIVITY
**  6.58E6,
*JOULE HEAT FRACTION
** 1.0,
*SPECIFIC HEAT
0.001,
*DENSITY
1000.,
*surface, NAME=SLAVE
ACTIVE, S3
*surface, NAME=MASTER
DEAD, S5
*CONTACT PAIR, INTERACTION=SLIDE
SLAVE, MASTER
*SURFACE INTERACTION, NAME=SLIDE
*GAP RADIATION
** converted from old data: 1.E-6, 1.E-6
*GAP HEAT GENERATION
*GAP ELECTRICAL CONDUCTANCE
*PHYSICAL CONSTANTS, ABSOLUTE ZERO=-273.16,STEFANB=1.7E-6
**
*AMPLITUDE, NAME=SLIDE, VALUE=RELATIVE, TIME=STEP
0.0, 0.0,  0.2, 1.0,  0.4, 0.0,  0.6, -1.0
0.8, 0.0,  1.0, 0.0
*AMPLITUDE, NAME=REMOVE, VALUE=RELATIVE, TIME=STEP
0.0, 1.0,  30.0, 0.0,  100.0, 0.0
**
*INITIAL CONDITIONS,TYPE=TEMP
ALL,0.0
**
*STEP,INC=50,NLGEOM,AMP=RAMP,UNSYMM=YES
Step 1
*COUPLED TEMPERATURE,DELTMX=100., ELECTRICAL
*CONTROLS,PARAMETERS=FIELD
1.0E-6,
*BOUNDARY
BOT,2,3
TOP,3,3
1,1,1
7,1,1
21,1,1
27,1,1
113,1,1
133,1,1
*BOUNDARY
TOP,9,9,0
BOT,9,9,0
*DLOAD
101,P5,100.
102,P5,100.
*DFLUX
101,S5,100.
102,S5,100.
*FILM
2,F3,0.,10.
*OUTPUT, FIELD, FREQ=10
*NODE OUTPUT
 NT, RFL
*ELEMENT OUTPUT
 S, E,
 TEMP,
 NFLUX,
*OUTPUT, FIELD, VAR=ALL
*END STEP
**
*STEP,INC=50,NLGEOM,AMP=RAMP
Step 2
*COUPLED TEMPERATURE,DELTMX=100., ELECTRICAL
*BOUNDARY,FIXED
TOP,2,2
*BOUNDARY,AMPLITUDE=SLIDE
113,1,1, 1.5
133,1,1, 1.5
*OUTPUT, FIELD, VAR=ALL
*END STEP
**
*STEP,INC=50,NLGEOM
Step 3
*COUPLED TEMPERATURE-DISPLACEMENT,STEADY STATE, ELECTRICAL
100000.,100000.
***SOLUTION TECHNIQUE,TYPE=SEPARATED
*BOUNDARY,OP=NEW
BOT,2,3
TOP,3,3
1,1,1
7,1,1
21,1,1
27,1,1
113,1,1
133,1,1
*BOUNDARY, OP=NEW
TOP,9,9,0
BOT,9,9,0
*OUTPUT, FIELD, FREQ=10
*ELEMENT OUTPUT
 S,E,EPG,HFL
*NODE OUTPUT
 EPOT,NT
*CONTACT OUTPUT
 CNAREA,CNORMF,CSTATUS
*END STEP
**
*STEP,INC=50,NLGEOM
Step 4
*COUPLED TEMPERATURE-DISPLACEMENT,STEADY STATE, ELECTRICAL
100000.,100000.
*DLOAD
101,P5,200.
102,P5,200.
*BOUNDARY
113,1,1,0.0
133,1,1,0.0
*OUTPUT, FIELD, VAR=ALL
*END STEP
**
*STEP,INC=50,NLGEOM,AMP=RAMP
Step 5
*COUPLED TEMPERATURE-DISPLACEMENT,DELTMX=100., ELECTRICAL
10.0, 100.0
*DFLUX, AMP=REMOVE
101, S5, 100.0
102, S5, 100.0
*BOUNDARY
113, 1,1, 10.0
133, 1,1, 10.0
*BOUNDARY,FIXED
TOP,2,2
*OUTPUT, FIELD, VAR=ALL
*END STEP