*HEADING
 DATA DECK TO VERIFY TEMPERATURE DEPENDENT MATERIAL PROPERTY FOR
 ELASTIC MATERIALS
*INCLUDE, INPUT=temp_elastic_ef1.inp
**  Elasticity
**  CPE6M ELEMENT
*ELEMENT, TYPE=CPE6M, ELSET=PEMELAS
**  TRUSS ELEMENT
*ELEMENT, TYPE=T2D2, ELSET=T2DELAS
*ELEMENT, TYPE=T3D2, ELSET=T3DELAS
**  BEAM ELEMENT
*ELEMENT, TYPE=B21, ELSET=B2DELAS
*ELEMENT, TYPE=B31, ELSET=B3DELAS
**  PIPE ELEMENT
*ELEMENT, TYPE=PIPE21, ELSET=PIPE2DELAS
*ELEMENT, TYPE=PIPE31, ELSET=PIPE3DELAS
**  AXISYMMETRIC SHELL ELEMENT
*ELEMENT, TYPE=SAX1, ELSET=SAXIELAS
**  3D SOLID ELEMENT
*ELEMENT, TYPE=C3D8R, ELSET=S3DELAS
*ELEMENT, TYPE=C3D10M, ELSET=S3DMELAS
**  PLANE STRAIN ELEMENT
*ELEMENT, TYPE=CPE4R, ELSET=PE2DELAS
**  PLANE STRESS ELEMENT
*ELEMENT, TYPE=CPS4R, ELSET=PS2DELAS
*ELEMENT, TYPE=CPS6M, ELSET=PSMELAS
**  AXISYMMETRIC SOLID ELEMENT
*ELEMENT, TYPE=CAX4R, ELSET=CAXELAS
*ELEMENT, TYPE=CAX6M, ELSET=CAXMELAS
**  SHELL ELEMENT
*ELEMENT, TYPE=S4R, ELSET=SHEELAS
*ELEMENT, TYPE=S4RS, ELSET=SHEELSS
*ELEMENT, TYPE=S4RSW, ELSET=SHEELSW
**  Membrane
*ELEMENT, TYPE=M3D4R, ELSET=MEMBELAS
*MATERIAL,NAME=A1ELAS
*ELASTIC
193.1E9, 0.0,   0.0
 97.0E9, 0.0, 100.0
*DENSITY
7850,
** Section Properties
*BEAM SECTION,SECTION=PIPE,ELSET=B2DELAS,MATERIAL=A1ELAS,TEMPERATURE=VALUE
0.1,0.01
*BEAM SECTION,SECTION=PIPE,ELSET=B3DELAS,MATERIAL=A1ELAS,TEMPERATURE=VALUE
0.1,0.01
*BEAM SECTION,SECTION=PIPE,ELSET=PIPE2DELAS,MATERIAL=A1ELAS,TEMPERATURE=VALUE
0.1,0.01
*BEAM SECTION,SECTION=PIPE,ELSET=PIPE3DELAS,MATERIAL=A1ELAS,TEMPERATURE=VALUE
0.1,0.01
*SHELL SECTION, SECTION INT=GAUSS,ELSET=SHEELAS,MATERIAL=A1ELAS
0.1, 3
*SHELL SECTION, SECTION INT=GAUSS,ELSET=SHEELSS,MATERIAL=A1ELAS
0.1, 3
*SHELL SECTION, SECTION INT=GAUSS,ELSET=SHEELSW,MATERIAL=A1ELAS
0.1, 3
*SHELL SECTION, SECTION INT=GAUSS, ELSET=SAXIELAS,MATERIAL=A1ELAS
0.1, 3
*SOLID SECTION,ELSET=S3DELAS,MATERIAL=A1ELAS
*SOLID SECTION,ELSET=S3DMELAS,MATERIAL=A1ELAS
*SOLID SECTION,ELSET=PE2DELAS,MATERIAL=A1ELAS
*SOLID SECTION,ELSET=PEMELAS,MATERIAL=A1ELAS
*SOLID SECTION,ELSET=PS2DELAS,MATERIAL=A1ELAS
*SOLID SECTION,ELSET=PSMELAS,MATERIAL=A1ELAS
*SOLID SECTION,ELSET=CAXELAS,MATERIAL=A1ELAS
*SOLID SECTION,ELSET=CAXMELAS,MATERIAL=A1ELAS
*MEMBRANE SECTION,ELSET=MEMBELAS,MATERIAL=A1ELAS
1.0,
*SOLID SECTION,ELSET=T2DELAS,MATERIAL=A1ELAS
*SOLID SECTION,ELSET=T3DELAS,MATERIAL=A1ELAS
0.1,0.1
**
**  Orthotropic material (Engineering Constants)
**  AXISYMMETRIC SHELL ELEMENT
*ELEMENT, TYPE=SAX1, ELSET=SAXIEC
**  3D SOLID ELEMENT
*ELEMENT, TYPE=C3D8R, ELSET=S3DEC
*ELEMENT, TYPE=C3D10M, ELSET=S3DMEC
**  PLANE STRAIN ELEMENT
*ELEMENT, TYPE=CPE4R, ELSET=PE2DEC
*ELEMENT, TYPE=CPE6M, ELSET=PEMEC
**  PLANE STRESS ELEMENT
*ELEMENT, TYPE=CPS4R, ELSET=PS2DEC
*ELEMENT, TYPE=CPS6M, ELSET=PSMEC
**  AXISYMMETRIC SOLID ELEMENT
*ELEMENT, TYPE=CAX4R, ELSET=CAXEC
*ELEMENT, TYPE=CAX6M, ELSET=CAXMEC
**  SHELL ELEMENT
*ELEMENT, TYPE=S4R, ELSET=SHEEC
**  MEMBRANE ELEMENT
*ELEMENT, TYPE=M3D4R, ELSET=MEMBEC
*ELEMENT, TYPE=S4RS, ELSET=SHEECS
*ELEMENT, TYPE=S4RSW, ELSET=SHEECW
*MATERIAL,NAME=A1EC
*ELASTIC,TYPE=ENGINEERING CONSTANTS
2.E+11,1.E+11,1.E+11,0.0,0.0,0.0,0.7692308E+11,0.7692308E+11
0.9E+10, 0.0
1.E+11,0.5E+11,0.5E+11,0.0,0.0,0.0,0.6692308E+11,0.6692308E+11
0.8E+10, 100.
*DENSITY
 7850.,
*MATERIAL,NAME=A1EC1
*ELASTIC,TYPE=ENGINEERING CONSTANTS
1.E+11,2.E+11,1.E+11,0.0,0.0,0.0,0.7692308E+11,0.9E+10
0.7692308E+11, 0.0
0.5E+11,1.E+11,0.5E+11,0.0,0.0,0.0,0.6692308E+11,0.8E+10
0.6692308E+11, 100.
*DENSITY
 7850.,
*SHELL SECTION, SECTION INT=GAUSS, ELSET=SHEEC,MATERIAL=A1EC
0.1, 3
*SHELL SECTION, SECTION INT=GAUSS, ELSET=SHEECS,MATERIAL=A1EC
0.1, 3
*SHELL SECTION, SECTION INT=GAUSS, ELSET=SHEECW,MATERIAL=A1EC
0.1, 3
*MEMBRANE SECTION,ELSET=MEMBEC,MATERIAL=A1EC
1.0,
*SHELL SECTION, SECTION INT=GAUSS, ELSET=SAXIEC,MATERIAL=A1EC1
0.1, 3
**local orientation matching global system
*ORIENTATION,NAME=RECT
*SOLID SECTION,ELSET=S3DEC,MATERIAL=A1EC,ORIENT=RECT
*SOLID SECTION,ELSET=S3DMEC,MATERIAL=A1EC,ORIENT=RECT
*SOLID SECTION,ELSET=PE2DEC,MATERIAL=A1EC,ORIENT=RECT
*SOLID SECTION,ELSET=PEMEC,MATERIAL=A1EC,ORIENT=RECT
*SOLID SECTION,ELSET=PS2DEC,MATERIAL=A1EC,ORIENT=RECT
*SOLID SECTION,ELSET=PSMEC,MATERIAL=A1EC,ORIENT=RECT
*SOLID SECTION,ELSET=CAXEC,MATERIAL=A1EC,ORIENT=RECT
*SOLID SECTION,ELSET=CAXMEC,MATERIAL=A1EC,ORIENT=RECT
**
** Orthotropic material(Orthotropic)
**  AXISYMMETRIC SHELL ELEMENT
*ELEMENT, TYPE=SAX1, ELSET=SAXIORTH
**  3D SOLID ELEMENT
*ELEMENT, TYPE=C3D8R, ELSET=S3DORTH
*ELEMENT, TYPE=C3D10M, ELSET=S3DMORTH
**  PLANE STRAIN ELEMENT
*ELEMENT, TYPE=CPE4R, ELSET=PE2DORTH
*ELEMENT, TYPE=CPE6M, ELSET=PEMORTH
**  PLANE STRESS ELEMENT
*ELEMENT, TYPE=CPS4R, ELSET=PS2DORTH
*ELEMENT, TYPE=CPS6M, ELSET=PSMORTH
**  AXISYMMETRIC SOLID ELEMENT
*ELEMENT, TYPE=CAX4R, ELSET=CAXORTH
*ELEMENT, TYPE=CAX6M, ELSET=CAXMORTH
**  SHELL ELEMENT
*ELEMENT, TYPE=S4R, ELSET=SHEORTH
*ELEMENT, TYPE=S4RS, ELSET=SHEORTS
*ELEMENT, TYPE=S4RSW, ELSET=SHEORTW
**  MEMBRANE ELEMENT
*ELEMENT, TYPE=M3D4R, ELSET=MEMBORTH
*MATERIAL,NAME=A1ORTH
*ELASTIC,TYPE=ORTHOTROPIC
2.24E+11,4.79E+5,1.23E+11,4.21E+5,4.74E+5,1.21E+11,7.69E+10,7.69E+10,
9.00E+9, 0.0
1.E+11,4.59E+5,0.5E+11,4.E+5,4.E+5,0.5E+11,7.E+10,7.E+10,
8.00E+9, 100.
*DENSITY
 7850.,
*MATERIAL,NAME=A1ORTHSAX
*ELASTIC,TYPE=ORTHOTROPIC
1.23E+11,4.79E+5,2.24E+11,4.74E+5,4.21E+5,1.21E+11,7.69E+10,7.69E+10,
9.00E+9, 0.0
0.5E+11,4.59E+5,1.E+11,4.E+5,4.E+5,0.5E+11,7.E+10,7.E+10,
8.00E+9, 100.
*DENSITY
 7850.,
*SHELL SECTION, SECTION INT=GAUSS, ELSET=SHEORTH,MATERIAL=A1ORTH
0.1, 3
*SHELL SECTION, SECTION INT=GAUSS, ELSET=SHEORTS,MATERIAL=A1ORTH
0.1, 3
*SHELL SECTION, SECTION INT=GAUSS, ELSET=SHEORTW,MATERIAL=A1ORTH
0.1, 3
*SHELL SECTION, SECTION INT=GAUSS, ELSET=SAXIORTH,MATERIAL=A1ORTHSAX
0.1, 3
*MEMBRANE SECTION,ELSET=MEMBORTH,MATERIAL=A1ORTH
1.0,
*SOLID SECTION,ELSET=S3DORTH,MATERIAL=A1ORTH,ORIENT=RECT
*SOLID SECTION,ELSET=S3DMORTH,MATERIAL=A1ORTH,ORIENT=RECT
*SOLID SECTION,ELSET=PE2DORTH,MATERIAL=A1ORTH,ORIENT=RECT
*SOLID SECTION,ELSET=PEMORTH,MATERIAL=A1ORTH,ORIENT=RECT
*SOLID SECTION,ELSET=PS2DORTH,MATERIAL=A1ORTH,ORIENT=RECT
*SOLID SECTION,ELSET=PSMORTH,MATERIAL=A1ORTH,ORIENT=RECT
*SOLID SECTION,ELSET=CAXORTH,MATERIAL=A1ORTH,ORIENT=RECT
*SOLID SECTION,ELSET=CAXMORTH,MATERIAL=A1ORTH,ORIENT=RECT
**
** Anisotropic material
**  3D SOLID ELEMENT
*ELEMENT, TYPE=C3D8R, ELSET=S3DAN
*ELEMENT, TYPE=C3D10M, ELSET=S3DMAN
**  PLANE STRAIN ELEMENT
*ELEMENT, TYPE=CPE4R, ELSET=PE2DAN
*ELEMENT, TYPE=CPE6M, ELSET=PEMAN
**  PLANE STRESS ELEMENT
*ELEMENT, TYPE=CPS4R, ELSET=PS2DAN
*ELEMENT, TYPE=CPS6M, ELSET=PSMAN
**  SHELL ELEMENT
*ELEMENT, TYPE=S4R, ELSET=SHEAN
*ELEMENT, TYPE=S4RS, ELSET=SHEANS
*ELEMENT, TYPE=S4RSW, ELSET=SHEANW
**  MEMBRANE ELEMENT
*ELEMENT, TYPE=M3D4R, ELSET=MEMBAN
*MATERIAL,NAME=A1AN
*ELASTIC,TYPE=ANISOTROPIC
2.24E+11,4.79E+5,1.23E+11,4.21E+5,4.74E+5,1.21E+11,1.E+6,2.E+6,
3.E+6,7.69E+10,4.E+6,5.E+6,6.E+6,7.E+6,7.69E+10,8.E+6,
9.E+6,10.E+6,11.E+6,12.E+6,9.00E+9, 0.
1.E+11,4.E+5,0.5E+11,4.E+5,4.E+5,0.5E+11,0.9E+6,1.8E+6,
2.6E+6,7.E+10,3.6E+6,4.6E+6,5.6E+6,6.6E+6,7.E+10,7.6E+6,
8.E+6,9.E+6,10.E+6,11.E+6,8.00E+9, 100.
*DENSITY
 7850.,
*SHELL SECTION, SECTION INT=GAUSS, ELSET=SHEAN,MATERIAL=A1AN
0.1, 3
*SHELL SECTION, SECTION INT=GAUSS, ELSET=SHEANS,MATERIAL=A1AN
0.1, 3
*SHELL SECTION, SECTION INT=GAUSS, ELSET=SHEANW,MATERIAL=A1AN
0.1, 3
*MEMBRANE SECTION,ELSET=MEMBAN,MATERIAL=A1AN
1.0,
*SOLID SECTION,ELSET=S3DAN,MATERIAL=A1AN,ORIENT=RECT
*SOLID SECTION,ELSET=S3DMAN,MATERIAL=A1AN,ORIENT=RECT
*SOLID SECTION,ELSET=PE2DAN,MATERIAL=A1AN,ORIENT=RECT
*SOLID SECTION,ELSET=PEMAN,MATERIAL=A1AN,ORIENT=RECT
*SOLID SECTION,ELSET=PS2DAN,MATERIAL=A1AN,ORIENT=RECT
*SOLID SECTION,ELSET=PSMAN,MATERIAL=A1AN,ORIENT=RECT
**
** Lamina
**  AXISYMMETRIC SHELL ELEMENT
*ELEMENT, TYPE=SAX1, ELSET=SAXILAMINA
**  PLANE STRESS ELEMENT
*ELEMENT, TYPE=CPS4R, ELSET=PS2DLAMINA
*ELEMENT, TYPE=CPS6M, ELSET=PSMLAMINA
**  SHELL ELEMENT
*ELEMENT, TYPE=S4R, ELSET=SHELAMINA
*ELEMENT, TYPE=S4RS, ELSET=SHELAMINS
*ELEMENT, TYPE=S4RSW, ELSET=SHELAMINW
**  Membrane
*ELEMENT, TYPE=M3D4R, ELSET=MEMBLAMINA
*MATERIAL,NAME=A1LAMINA
*ELASTIC,TYPE=LAMINA
2.E+11,1.5E+11,0.0,2.E+10,9.E+9,8.5E+9, 0.
1.E+11,0.7E+11,0.0,1.8E+10,8.E+9,7.5E+9, 100.
*DENSITY
 7850.,
*MATERIAL,NAME=A1LAMSAX
*ELASTIC,TYPE=LAMINA
1.5E+11,2.E+11,0.0,2.E+10,8.5E+9,9.E+9, 0.
0.7E+11,1.E+11,0.0,1.8E+10,7.5E+9,8.E+9, 100.
*DENSITY
 7850.,
*SHELL SECTION, SECTION INT=GAUSS,ELSET=SHELAMINA,MATERIAL=A1LAMINA
0.1, 3
*SHELL SECTION, SECTION INT=GAUSS,ELSET=SHELAMINS,MATERIAL=A1LAMINA
0.1, 3
*SHELL SECTION, SECTION INT=GAUSS,ELSET=SHELAMINW,MATERIAL=A1LAMINA
0.1, 3
*SHELL SECTION, SECTION INT=GAUSS,ELSET=SAXILAMINA,MATERIAL=A1LAMSAX
0.1, 3
*SOLID SECTION,ELSET=PS2DLAMINA,MATERIAL=A1LAMINA,ORIENT=RECT
*SOLID SECTION,ELSET=PSMLAMINA,MATERIAL=A1LAMINA,ORIENT=RECT
*MEMBRANE SECTION,ELSET=MEMBLAMINA,MATERIAL=A1LAMINA
1.0,
*ELSET, ELSET=EALL2
*ELSET, ELSET=EALL2
EALL2,
*NSET, NSET=BOTTOM
BOTTOM,
*NSET, NSET=TOP
TOP,
*NSET,NSET=SFACE
SFACE,
*BOUNDARY
BOTTOM,2,2
SFACE,3,3
*INITIAL CONDITION, TYPE=TEMPERATURE
B2ALL, 0.0, 0.0, 0.0
B3ALL, 0.0, 0.0, 0.0, 0.0
SALL, 0.0
*ELSET, ELSET=EALL
EALL2,
*RESTART,TIMEMARKS=NO,WRITE,NUMBER=10
*AMPLITUDE, NAME=VAMP
0., 0., 0.01, 0.2
**
*ELSET,ELSET=QA_TEST_All_ELSETS_AUTO
PEMELAS, T2DELAS, T3DELAS, B2DELAS, B3DELAS, SAXIELAS, S3DELAS, S3DMELAS, PE2DELAS, PS2DELAS, PSMELAS, CAXELAS, CAXMELAS, SHEELAS, SHEELSS, SHEELSW, MEMBELAS, B2DELAS, B3DELAS, SHEELAS, SHEELSS, SHEELSW, SAXIELAS, S3DELAS, S3DMELAS, PE2DELAS, PEMELAS, PS2DELAS, PSMELAS, CAXELAS, CAXMELAS, MEMBELAS, T2DELAS, T3DELAS, SAXIEC, S3DEC, S3DMEC, PE2DEC, PEMEC, PS2DEC, PSMEC, CAXEC, CAXMEC, SHEEC, MEMBEC,
*NSET,NSET=QA_TEST_All_NSETS_AUTO
BOTTOM, TOP, SFACE,
*STEP
*DYNAMIC,EXPLICIT
,0.01
*TEMPERATURE
 B2ALL, 100.0, 100.0, 100.0
 B3ALL, 100.0, 100.0, 100.0, 100.0
 SALL, 100.0
*BOUNDARY, TYPE=VELOCITY, AMPLITUDE=VAMP
 TOP, 2, 2, 1.0
**
*FILE OUTPUT,TIMEMARKS=YES,NUM=1
*EL FILE
 MISES,
 LE,
 TEMP,
**
*OUTPUT,FIELD,VARIABLE=PRESELECT,NUMBER INTERVAL=4,OP=NEW
*OUTPUT,HISTORY,VARIABLE=PRESELECT,TIME INTERVAL=0.0025,OP=NEW
*OUTPUT, FIELD,TIMEMARKS=YES,NUM=1
*ELEMENT OUTPUT,ELSET=QA_TEST_All_ELSETS_AUTO
 MISES,
 LE,
 TEMP,
*END STEP