*HEADING
 Transfer from Standard to Explicit : Test for S3R element
 - Explicit analysis
 - further loading in shear
*IMPORT,STEP=1,UPDATE=NO,STATE=YES
 SHELL,
*IMPORT NSET
 ALL, SIDE
*MATERIAL,NAME=STEEL
*ELASTIC
 200.E9, 0.3
*DENSITY
 1000.,
*BOUNDARY
 ALL, 3,3
 1, 1,2
 2, 1,2
 3, 2,2
 4, 2,2
**
**
*NSET,NSET=TOP
*ELSET,ELSET=QA_TEST_ALLELEMS
SHELL
*NSET,NSET=QA_TEST_ALLNODES
ALL
*AMPLITUDE,NAME=AMP1,DEFINITION=SMOOTH
0,0,0.01,1.0
**
*STEP
*DYNAMIC,EXPLICIT
 , 0.01
*BOUNDARY,TYPE=VELOCITY,AMPLITUDE=AMP1
TOP,1,1,5
*OUTPUT,FIELD,VARIABLE=PRESELECT
**FOR QA PURPOSE
*OUTPUT, FIELD, TIMEMARKS=YES, NUMBER INTERVAL=4
*ELEMENT OUTPUT,ELSET=QA_TEST_ALLELEMS
 LE,
*NODE OUTPUT,NSET=QA_TEST_ALLNODES
COORD,
*OUTPUT,HISTORY,TIME INTERVAL=0.001
*ENERGY OUTPUT
ALLIE,ALLKE,ALLSE,ALLWK,ETOTAL
*END STEP