*HEADING
 Transfer from Standard to Explicit : Plasticity Test for CPE3 element
 - Explicit Analysis
 - Plastic material
*IMPORT,STEP=2,UPDATE=NO,STATE=YES
 SHELL,
*IMPORT NSET
 ALL,
*MATERIAL,NAME=STEEL
*ELASTIC
 200.E3, 0.3
*PLASTIC
200.0, 0.000
220.0, 0.001
*DENSITY
 1000.,
*BOUNDARY
 1, 1,2
 2, 2,2
 4, 1,1
**
**
*ELSET, ELSET=QA_TEST_ALLELEMS, GENERATE
**
*NSET, NSET=QA_TEST_ALLNODES, GENERATE
**
*STEP,NLGEOM=YES
*DYNAMIC,EXPLICIT
 , 0.02
*BULK VISCOSITY
*BOUNDARY, TYPE=VELOCITY
 3, 1, 1, 0.8
 2, 1, 1, 0.8
*FILE OUTPUT,TIMEMARKS=YES, NUM=1
*EL FILE
 PEEQ,
*NODE FILE
 U,
*OUTPUT, FIELD, TIMEMARKS=YES, NUMBER INTERVAL=1
*ELEMENT OUTPUT, ELSET=QA_TEST_ALLELEMS
 PEEQ,
*NODE OUTPUT, NSET=QA_TEST_ALLNODES
 U,
*OUTPUT,FIELD,VARIABLE=PRESELECT
*OUTPUT,HISTORY,VARIABLE=PRESELECT,TIMEINT=0.02
***OUTPUT,HISTORY,VARIABLE=PRESELECT
*END STEP