*HEADING
 Transfer from  Standard to Explicit : Test for C3D8R element
 - Explicit analysis
 - further loading in tension
*IMPORT,STEP=1,UPDATE=YES,STATE=YES
 SHELL,
*IMPORT NSET
 ALL, SIDE
*MATERIAL,NAME=STEEL
*ELASTIC
 200.E9, 0.3
*DENSITY
 1000.,
*BOUNDARY
 1, 1,3
 2, 2,3
 3, 1,1
 3, 3,3
 4, 3,3
 5, 1,2
 6, 2,2
 7, 1,1
**
**
*NSET,NSET=RIGHT
*ELSET,ELSET=QA_TEST_ALLELEMS
SHELL
*NSET,NSET=QA_TEST_ALLNODES
ALL
*AMPLITUDE,NAME=AMP1,DEFINITION=SMOOTH
0,0,0.01,1.0
**
*STEP
*DYNAMIC,EXPLICIT
 , 0.01,
*BOUNDARY,TYPE=VELOCITY,AMPLITUDE=AMP1
RIGHT,1,1,5
*OUTPUT,FIELD,VARIABLE=PRESELECT
**FOR QA PURPOSE
*OUTPUT, FIELD, TIMEMARKS=YES, NUMBER INTERVAL=4
*ELEMENT OUTPUT,ELSET=QA_TEST_ALLELEMS
 LE,
*NODE OUTPUT,NSET=QA_TEST_ALLNODES
COORD,UT
*OUTPUT,HISTORY,TIME INTERVAL=0.001
*ENERGY OUTPUT
ALLIE,ALLKE,ALLSE,ALLWK,ETOTAL
*END STEP