*HEADING
Test embedded element with 3-D first order membrane and solid elements
*PREPRINT,MODEL=YES,ECHO=YES,HISTORY=YES
*NODE
*ELEMENT, TYPE=C3D8R, ELSET=HOSTSOLID3D
*ELEMENT, TYPE=C3D8R, ELSET=SOLID3D
*ELEMENT, TYPE=M3D4R, ELSET=MEM3D
*SOLID SECTION,ELSET=HOSTSOLID3D,MATERIAL=STEEL
*MATERIAL,NAME=STEEL
*ELASTIC
2.1E11
*DENSITY
7800.0
*MEMBRANE SECTION,ELSET=MEM3D,MATERIAL=STEEL2
1.0
*REBAR LAYER,ORI=REBAR
REB,0.3,0.5,0,MAT2,20.0,1
*MATERIAL,NAME=STEEL2
*ELASTIC
5.0E11
*DENSITY
7800.,
*ORIENTATION, NAME=REBAR, DEFINITION=OFFSET TO NODES
*MATERIAL,NAME=MAT2
*ELASTIC
 7.0E11,
*DENSITY
7800.,
*SOLID SECTION,ELSET=SOLID3D,MATERIAL=STEEL2
*EMBEDDED ELEMENT,HOST ELSET=HOSTSOLID3D,ROUND OFF TOLERANCE=0.005, EXTERIOR TOLERANCE=0.01
SOLID3D,MEM3D
*BOUNDARY, TYPE=VELOCITY
1,1,3
5,1,3
9,1,3
13,1,3
*RESTART,WRITE
*STEP,nlgeom
*STATIC
0.2,1.0
*BOUNDARY, TYPE=VELOCITY
4,1,1,0.05
8,1,1,0.05
12,1,1,0.05
16,1,1,0.05
*OUTPUT,FIELD, FREQ=10
*ELEMENT OUTPUT,ELSET=MEM3D
S, LE
*ELEMENT OUTPUT,ELSET=MEM3D,REBAR
S, LE
*ELEMENT OUTPUT,ELSET=SOLID3D
S, LE
*ELEMENT OUTPUT,ELSET=HOSTSOLID3D
S, LE
*EL FILE,ELSET=HOSTSOLID3D, FREQ=10
S, E
*EL FILE,ELSET=SOLID3D, FREQ=10
S, E
*EL FILE,ELSET=MEM3D, FREQ=10
S, E
*EL FILE,ELSET=MEM3D,REBAR, FREQ=10
S, E
*EL PRINT,ELSET=MEM3D
S, E
*EL PRINT,ELSET=MEM3D,REBAR
S, E
*EL PRINT,ELSET=SOLID3D
S
E
*EL PRINT,ELSET=HOSTSOLID3D
S
E
*END STEP
*STEP
*STATIC
0.2,1.0
*BOUNDARY, TYPE=VELOCITY
4,1,1,0.05
8,1,1,0.05
12,1,1,0.05
16,1,1,0.05
*OUTPUT,FIELD, FREQ=10
*ELEMENT OUTPUT,ELSET=MEM3D
S, LE
*ELEMENT OUTPUT,ELSET=MEM3D,REBAR
S, LE
*ELEMENT OUTPUT,ELSET=SOLID3D
S, LE
*ELEMENT OUTPUT,ELSET=HOSTSOLID3D
S, LE
*EL FILE,ELSET=HOSTSOLID3D, FREQ=10
S, E
*EL FILE,ELSET=SOLID3D, FREQ=10
S, E
*EL FILE,ELSET=MEM3D, FREQ=10
S, E
*EL FILE,ELSET=MEM3D,REBAR, FREQ=10
S, E
*EL PRINT,ELSET=MEM3D
S, E
*EL PRINT,ELSET=MEM3D,REBAR
S, E
*EL PRINT,ELSET=SOLID3D
S
E
*EL PRINT,ELSET=HOSTSOLID3D
S
E
*END STEP