*HEADING
Import of MCTC S2X: input for S
*restart,write,freq=100
*NODE, NSET=QA_TEST_ALLNODES
**
*nset,nset=nx0
*nset,nset=ny0
*NSET,NSET=nz0
*NSET,NSET=nx1
*NSET,NSET=nz1
*ELEMENT,TYPE=C3D8R,ELSET=C3D_1
*SOLID SECTION,ELSET=C3D_1,MATERIAL=M1
*MATERIAL,NAME=M1
*DENSITY
1.e-2
*ELASTIC
2.E7,0.3
*mohr coulomb
*mohr coulomb HARDENING
*tension cutoff
**
*boundary
nx0,1,1
ny0,2,2
nz0,3,3
*STEP,nlgeom=yes,inc=100
*static
0.1,1
*print,solve=no
*BOUNDARY
nz1,3,3,0.1
**
*OUTPUT, FIELD,freq=100
*ELEMENT OUTPUT
S,PEEQ,PEEQT
*NODE OUTPUT
U,
*OUTPUT,HISTORY
*element output,elset=c3d_1
peeq,peeqt,pener
*END STEP
*STEP,nlgeom=yes,inc=100
*static
0.1,1
*BOUNDARY
nz1,3,3,-0.1
*END STEP