*HEADING
 Transfer of results between ABAQUS/Standard and ABAQUS/Explicit
 - Test for transfer of hourglass forces
*NODE
*NGEN, NSET=FIX
*NCOPY, OLDSET=FIX, NEWSET=END, SHIFT, CHANGE=4
*NFILL, NSET=NALL
 FIX, END, 4, 1
*ELEMENT, TYPE=CPS4R
*ELGEN, ELSET=EALL
*ELSET, ELSET=LOAD, GEN
*SOLID SECTION, ELSET=EALL, MATERIAL=MAT,CONTROLS=HGC
*SECTION CONTROLS,NAME=HGC,HOURGLASS=ENHANCED
*MATERIAL, NAME=MAT
*ELASTIC
 200.E9, 0.3
*DENSITY
 1000.,
*BOUNDARY
 FIX,1,2
*RESTART, WRITE, FREQ=10
*FILE FORMAT, ZERO INCREMENT
*AMPLITUDE, DEFINITION=SMOOTHSTEP, TIME=TOTAL, NAME=AMP1
 0.0,0.0,0.001,1.0
*******************************************
*STEP, NLGEOM, INC=1000
*DYNAMIC, HAFTOL=1.0E7,ALPHA=-0.33
 0.0001, 0.001
*BOUNDARY, TYPE=DISPLACEMENT, AMPLITUDE=AMP1
 45,2,2,-0.1
*EL PRINT, F=0
*NODE PRINT, F=0
*OUTPUT,FIELD,FREQ=20
*ELEMENT OUTPUT
S,
LE,
*NODE OUTPUT
RF,
U
*OUTPUT,HISTORY
***ELEMENT OUTPUT,ELSET=LOAD
**S,LE
***NODE OUTPUT,NSET=END
**U,
***NODE OUTPUT,NSET=FIX
**RF,
*ENERGY OUTPUT,VARIABLE=PRESELECT
*END STEP
****************************************
*STEP, NLGEOM, INC=1000
*DYNAMIC, HAFTOL=1.0E7,ALPHA=-0.33
 0.0001, 0.0015
*BOUNDARY, FIXED
 45,2
*END STEP