*HEADING
 Transfer from Standard to Explicit: Test for C3D6T element
*NODE,NSET=ALL
*NSET,NSET=SIDE
*ELEMENT, TYPE=C3D6T, ELSET=SHELL
*SOLID SECTION, ELSET=SHELL, MATERIAL=STEEL
*MATERIAL,NAME=STEEL
*ELASTIC
 200.E9, 0.3
*DENSITY
 1000.,
*CONDUCTIVITY
1.713,
*SPECIFIC HEAT
0.4
*BOUNDARY
 1, 1,3
 2, 1,3
 3, 2,3
 4, 2,3
 5, 1,3
 6, 1,3
 7, 2,3
 8, 2,3
*RESTART,WRITE
**
**
*ELSET,ELSET=QA_TEST_ALLELEMS
SHELL,
**
*NSET, NSET=QA_TEST_ALLNODES
ALL, SIDE
**
*STEP,NLGEOM,INC=50
*COUPLED TEMPERATURE-DISPLACEMENT, STEADY STATE
 0.1, 1.
*CONTROLS, PARAMETERS=FIELD, FIELD=DISPLACEMENT
 5.e-4,,,,
*BOUNDARY, TYPE=VELOCITY
 3, 1, 1, 2.
 4, 1, 1, 2.
 7, 1, 1, 2.
 8, 1, 1, 2.
 3,11,  , 0.
*CFLUX
 1,,100.0
 2,,100.0
 5,,100.0
 6,,100.0
*PRINT,FREQ=1
*EL PRINT,FREQ=1
 S,
 E,
 PEEQ,
*ENERGY PRINT, FREQ=1
 ALLKE,ALLSE,ALLWK,ALLIE,ETOTAL
*NODE PRINT,FREQ=1
 U,
 COORD,
 RF,
*OUTPUT,FIELD,VARIABLE=PRESELECT,FREQUENCY=9999
*OUTPUT,FIELD
*ELEMENT OUTPUT
 S,LE
*OUTPUT,HISTORY
*ELEMENT OUTPUT, ELSET=QA_TEST_ALLELEMS
 S,LE
*OUTPUT,FIELD
*NODE OUTPUT
 U,COORD
*OUTPUT,HISTORY
*NODE OUTPUT, NSET=QA_TEST_ALLNODES
 U,COORD
*END STEP