*HEADING
ABAQUS/Explicit Quasi-Static
Global analysis: [C3D8R]
*NODE,NSET=ALL
*NGEN,NSET=NL1
*NGEN,NSET=NR1
*NFILL,NSET=ALL1
NL1,NR1,9,10
*NGEN,NSET=NL2
*NGEN,NSET=NR2
*NFILL,NSET=ALL2
NL2,NR2,9,10
*NGEN,NSET=NL3
*NGEN,NSET=NR3
*NFILL,NSET=ALL3
NL3,NR3,9,10
*NSET,NSET=FIX1,GEN
*NSET,NSET=FIX2,GEN
*NSET,NSET=FIX3,GEN
*NSET,NSET=FIX4,GEN
*NSET,NSET=ALL
ALL1,ALL2,ALL3
*NSET,NSET=NALL
FIX1,FIX2,FIX3,FIX4
*NSET,NSET=QA_TEST
*ELEMENT, TYPE=C3D8R, ELSET=EALL
*ELGEN,ELSET=EALL
*ELSET,ELSET=EFLUX2,GEN
*SOLID SECTION,MATERIAL=MAT1, ELSET=EALL
*MATERIAL,NAME=MAT1
*ELASTIC
 110.E9, .3
*DENSITY
8900,
*RESTART,WRITE
*****************************************
*AMPLITUDE,NAME=RAMP,DEFINITION=SMOOTH STEP
0,0,1.5e6,1
*STEP
*DYNAMIC, EXPLICIT
,1.5e6
*FIXED MASS SCALING,FACTOR=1e14
*BOUNDARY, OP=NEW
 ALL1,  3
 ALL3,  3
 FIX1,  2
 FIX4,  1
 FIX4, 11
*DLOAD,AMP=RAMP
 EFLUX2, P4, -1e9
***********************************
***    DO NOT MODIFY THE GLOBAL ***
***          FIL REQUEST     ******
***********************************
*FILE OUTPUT,NUMBER INTERVAL=20
*NODE FILE
NT,U
**************
*OUTPUT, FIELD, NUMBER INTERVAL = 1
*NODE OUTPUT,NSET=QA_TEST
U,
*OUTPUT, HISTORY, TIME INT=1.5e6
*ENERGY OUTPUT,VAR=ALL
*****************
*OUTPUT, HISTORY, TIME INT=0.5e5
*NODE OUTPUT,NSET=NALL
U,
*****************
*OUTPUT, FIELD, NUMBER INTERVAL = 1
*ELEMENT OUTPUT, ELSET=EALL
 S,
*NODE OUTPUT
 U,
****************
*END STEP