*HEADING
:Submodel from submodel2delem_cps_g_xpl [CPS4R]
*PREPRINT, MODEL=YES,HISTORY=YES,HISTORY=YES
*NODE
*NGEN,NSET=NL
*NGEN,NSET=NR
*NFILL,NSET=NALL
NL,NR,6,100
*NSET,NSET=QA_TEST
NR,
*ELEMENT,TYPE=CPS4R,ELSET=EALL
*ELGEN,ELSET=EALL
*SOLID SECTION,MATERIAL=MAT1,ELSET=EALL
*MATERIAL,NAME=MAT1
*DENSITY
10.0
*ELASTIC
30.E6,0.3
*ELSET,ELSET=LOAD
*SUBMODEL,EXT=0.07
NL,
*AMPLITUDE,NAME=RAMP,DEF=SMOOTH STEP
0,0,0.02,1
*STEP
*DYNAMIC,EXPLICIT
,0.02
*BOUNDARY,SUBMODEL,STEP=1
NL,1,2
*DLOAD,,AMP=RAMP
 LOAD, P2, -1000000.0
***************
*FILE OUTPUT,NUMBER INTERVAL=1
*NODE FILE,NSET=NR
 U,
**************
*OUTPUT, FIELD, NUMBER INTERVAL = 1
*NODE OUTPUT,NSET=QA_TEST
 U,
*OUTPUT, HISTORY, TIME INT=0.02
*ENERGY OUTPUT,VAR=ALL
*****************
*OUTPUT, HISTORY, TIME INT=0.002
*NODE OUTPUT,NSET=NALL
U,
*****************
*OUTPUT, FIELD, NUMBER INTERVAL = 4
*ELEMENT OUTPUT, ELSET=EALL
 S,
*NODE OUTPUT
 U,
****************
*END STEP