*HEADING
: Global model Explicit analysis
Uniaxial tension [CPE3,CPE4R]
*NODE,NSET=NL
*NODE,NSET=NR
*NFILL,NSET=NALL
NL,NR,4,100
*NSET,NSET=QA_TEST
NR,
*ELEMENT,TYPE=CPE3,ELSET=EALL
*ELEMENT,TYPE=CPE4R,ELSET=EALL
*ELGEN,ELSET=EALL
*SOLID SECTION,MATERIAL=A1, ELSET=EALL
*MATERIAL,NAME=A1
*DENSITY
10.0
*ELASTIC,TYPE=ISOTROPIC
 30.0E6,0.3
*ELSET,ELSET=LOAD
*BOUNDARY
 NL,1,1
 1,2
*AMPLITUDE,NAME=RAMP,DEF=SMOOTH STEP
0,0,0.02,1
*STEP
*DYNAMIC, EXPLICIT
 ,0.02
*DLOAD,AMP=RAMP
 LOAD, P2, -1000000.0
***********************************
***    DO NOT MODIFY THE GLOBAL ***
***          FIL REQUEST     ******
***********************************
*FILE OUTPUT,NUMBER INTERVAL=10
*NODE FILE
 U,
**************
*OUTPUT, FIELD, NUMBER INTERVAL = 1
*NODE OUTPUT,NSET=QA_TEST
 U,
*OUTPUT, HISTORY, TIME INT=0.02
*ENERGY OUTPUT,VAR=ALL
*****************
*OUTPUT, HISTORY, TIME INT=0.002
*NODE OUTPUT,NSET=NALL
U,
*****************
*OUTPUT, FIELD, NUMBER INTERVAL = 10
*ELEMENT OUTPUT, ELSET=EALL
 S,
*NODE OUTPUT
 U,
****************
*END STEP