*HEADING
Submodel analysis from:
submcoupledtmp_g_c3d4t_xpl or
submcoupledtmp_g_c3d6t_xpl or
submcoupledtmp_g_c3d8rt_xpl
with c3d6t
*NODE,NSET=ALL
*NGEN,NSET=NL1
*NGEN,NSET=NR1
*NFILL,NSET=ALL1
NL1,NR1,9,10
*NGEN,NSET=NL2
*NGEN,NSET=NR2
*NFILL,NSET=ALL2
NL2,NR2,9,10
*NGEN,NSET=NL3
*NGEN,NSET=NR3
*NFILL,NSET=ALL3
NL3,NR3,9,10
*NSET,NSET=FIX1,GEN
*NSET,NSET=FIX2,GEN
*NSET,NSET=FIX3,GEN
*NSET,NSET=FIX4,GEN
*NSET,NSET=ALL
ALL1,ALL2,ALL3
*NSET,NSET=NALL
FIX1,FIX2,FIX3,FIX4
*NSET,NSET=QA_TEST
NR1,
*ELEMENT, TYPE=C3D6T, ELSET=EALL
*ELGEN,ELSET=EALL
*ELSET,ELSET=EFLUX2,GEN
*SUBMODEL
FIX3,FIX4
*SOLID SECTION,MATERIAL=COPPER, ELSET=EALL
******************************
*********Copper material******
******************************
*MATERIAL,NAME=COPPER
*ELASTIC
 110.E9, .3
*EXPANSION
1e-3,
*CONDUCTIVITY
390,
*SPECIFIC HEAT
384,
*DENSITY
8900,
*RESTART,WRITE
*****************************************
*STEP
*DYNAMIC TEMPERATURE-DISPLACEMENT,EXPLICIT
*FIXED MASS SCALING,FACTOR=1e14
*BOUNDARY
 ALL1,  3
 ALL3,  3
 FIX1,  2
*BOUNDARY, SUBMODEL, STEP=1
 FIX3, 11
 FIX4, 11
 FIX3, 1,2
 FIX4, 1,2
*DFLUX,OP=NEW
 EFLUX2, S4, 0.5e3
*FILE OUTPUT,NUMBER INTERVAL=1
*NODE FILE
NT
**************
*OUTPUT, FIELD, NUMBER INTERVAL = 1
*NODE OUTPUT,NSET=QA_TEST
 U,NT
*OUTPUT, HISTORY, TIME INT=1.5e6
*ENERGY OUTPUT,VAR=ALL
*****************
*OUTPUT, HISTORY, TIME INT=0.5e5
*NODE OUTPUT,NSET=NALL
U,NT11
*****************
*OUTPUT, FIELD, NUMBER INTERVAL = 4
*ELEMENT OUTPUT, ELSET=EALL
 S,
*NODE OUTPUT
 U,NT
****************
*END STEP