*HEADING
NONSTRUCTURAL MASS VERIFICATION - SINGLE ELEMENT DECKS WITH
"MASS" UNITS.
*PREPRINT, MODEL=YES
*RESTART,WRITE
*********************
*****T2D2************
*NODE,NSET=NALL
*NSET,NSET=DISP
*NSET,NSET=FIXED
*ELEMENT,TYPE=T2D2,ELSET=REFER1
*ELEMENT,TYPE=T2D2,ELSET=TEST1
*SOLID SECTION,ELSET=REFER1,MATERIAL=NOSCALE
.5,
*SOLID SECTION,ELSET=TEST1,MATERIAL=SCALE
.5,
*ELSET,ELSET=NOSCALE
REFER1,
*ELSET,ELSET=SCALE
TEST1,
************************
******T3D2***************
*NODE,NSET=NALL
*NSET,NSET=DISP
*NSET,NSET=FIXED
*ELEMENT,TYPE=T3D2,ELSET=REFER2
*ELEMENT,TYPE=T3D2,ELSET=TEST2
*SOLID SECTION,ELSET=REFER2,MATERIAL=NOSCALE
.5,
*SOLID SECTION,ELSET=TEST2,MATERIAL=SCALE
.5,
*ELSET,ELSET=NOSCALE
REFER2,
*ELSET,ELSET=SCALE
TEST2,
**************************
******************************
** REMAINDER OF DECK SAME FOR ALL TESTS
******************************
*MATERIAL,NAME=NOSCALE
*ELASTIC
1.E6, .25
*DENSITY
1.E-4,
*MATERIAL,NAME=SCALE
*ELASTIC
1.E6, .25
*DENSITY
1.E-7,
*BOUNDARY
FIXED,1,3
**************************
*AMPLITUDE,NAME=SMOOTH,DEFINITION=SMOOTH STEP
0.,0.,  .00015, 1.
**************************
*NSET,NSET=QA_TEST_FIXED
FIXED,
*ELSET,ELSET=QA_TEST
SCALE,NOSCALE
*NONSTRUCTURAL MASS, UNITS=MASS PER LENGTH, ELSET=SCALE
**
*STEP
*DYNAMIC
1.0E-5,.00015,1.0E-6
*BOUNDARY,AMP=SMOOTH
DISP, 1,1, .05
*OUTPUT, FIELD, FREQ=4
*NODE OUTPUT, NSET=QA_TEST_FIXED
RF,
*OUTPUT,FIELD,VARIABLE=PRESELECT,FREQ=4
*OUTPUT,HISTORY,VARIABLE=PRESELECT,FREQ=2
*END STEP