*Heading
** Job name: heattransfer3d Model name: Model-1
** Generated by: Abaqus/CAE 6.9-EFR
*Preprint, echo=NO, model=NO, history=NO, contact=NO
**
** PARTS
**
*Part, name=Part-1
*End Part
**
**
** ASSEMBLY
**
*Assembly, name=Assembly
**
*Instance, name=Part-1-1, part=Part-1
*Node
*Element, type=C3D4
*Nset, nset=_PickedSet2, internal, generate
*Elset, elset=_PickedSet2, internal, generate
** Section: Section-1
*Solid Section, elset=_PickedSet2, material=Material-1
*End Instance
**
*Instance, name=Part-1-1-lin-2-1, part=Part-1
*Node
*Element, type=C3D6
*Nset, nset=_PickedSet2, internal, generate
*Elset, elset=_PickedSet2, internal, generate
** Section: Section-1
*Solid Section, elset=_PickedSet2, material=Material-1
*End Instance
**
*Instance, name=Part-1-1-lin-3-1, part=Part-1
*Node
*Element, type=C3D8
*Nset, nset=_PickedSet2, internal, generate
*Elset, elset=_PickedSet2, internal, generate
** Section: Section-1
*Solid Section, elset=_PickedSet2, material=Material-1
*End Instance
**
*Instance, name=Part-1-1-lin-4-1, part=Part-1
*Node
*Element, type=C3D10
*Nset, nset=_PickedSet2, internal, generate
*Elset, elset=_PickedSet2, internal, generate
** Section: Section-1
*Solid Section, elset=_PickedSet2, material=Material-1
*End Instance
**
*Instance, name=Part-1-1-lin-5-1, part=Part-1
*Node
*Element, type=C3D10M
*Nset, nset=_PickedSet2, internal, generate
*Elset, elset=_PickedSet2, internal, generate
** Section: Section-1
*Solid Section, elset=_PickedSet2, material=Material-1
*End Instance
**
*Instance, name=Part-1-1-lin-6-1, part=Part-1
*Node
*Element, type=C3D15
*Nset, nset=_PickedSet2, internal, generate
*Elset, elset=_PickedSet2, internal, generate
** Section: Section-1
*Solid Section, elset=_PickedSet2, material=Material-1
*End Instance
**
*Instance, name=Part-1-1-lin-7-1, part=Part-1
*Node
*Element, type=C3D20R
*Nset, nset=_PickedSet2, internal, generate
*Elset, elset=_PickedSet2, internal, generate
** Section: Section-1
*Solid Section, elset=_PickedSet2, material=Material-1
*End Instance
**
*Nset, nset=fix, instance=Part-1-1, generate
*Nset, nset=fix, instance=Part-1-1-lin-2-1
*Nset, nset=fix, instance=Part-1-1-lin-4-1
*Nset, nset=fix, instance=Part-1-1-lin-6-1
*Nset, nset=fix, instance=Part-1-1-lin-3-1
*Nset, nset=fix, instance=Part-1-1-lin-7-1
*Nset, nset=fix, instance=Part-1-1-lin-5-1
*Elset, elset=fix, instance=Part-1-1
*Elset, elset=fix, instance=Part-1-1-lin-2-1, generate
*Elset, elset=fix, instance=Part-1-1-lin-4-1
*Elset, elset=fix, instance=Part-1-1-lin-6-1, generate
*Elset, elset=fix, instance=Part-1-1-lin-3-1, generate
*Elset, elset=fix, instance=Part-1-1-lin-7-1, generate
*Elset, elset=fix, instance=Part-1-1-lin-5-1
*Nset, nset=all_nodes, instance=Part-1-1, generate
*Nset, nset=all_nodes, instance=Part-1-1-lin-2-1, generate
*Nset, nset=all_nodes, instance=Part-1-1-lin-4-1, generate
*Nset, nset=all_nodes, instance=Part-1-1-lin-6-1, generate
*Nset, nset=all_nodes, instance=Part-1-1-lin-3-1, generate
*Nset, nset=all_nodes, instance=Part-1-1-lin-7-1, generate
*Nset, nset=all_nodes, instance=Part-1-1-lin-5-1, generate
*Elset, elset=all_nodes, instance=Part-1-1, generate
*Elset, elset=all_nodes, instance=Part-1-1-lin-2-1, generate
*Elset, elset=all_nodes, instance=Part-1-1-lin-4-1, generate
*Elset, elset=all_nodes, instance=Part-1-1-lin-6-1, generate
*Elset, elset=all_nodes, instance=Part-1-1-lin-3-1, generate
*Elset, elset=all_nodes, instance=Part-1-1-lin-7-1, generate
*Elset, elset=all_nodes, instance=Part-1-1-lin-5-1, generate
*End Assembly
**
** MATERIALS
**
*Material, name=Material-1
*Elastic
 200.e9, 0.3
*Expansion
 1.e-6,
*Expansion, Field=2
 1.e-6,
*Initial Conditions, Type=Temperature, file=heattransfer_dc3d8.odb, step=1, inc=0, interpolate
*Initial Conditions, Type=Field,file=piezoelectric_c3d8e.odb, step=2, inc=0., variable=2, output variable=epot, interpolate
** ----------------------------------------------------------------
**
** STEP: Step-1
**
*Step, name=Step-1, nlgeom=yes
 Expansion - Thermal, Electric
*Static
 0.2, 1., 0.2, 0.2,
**
** BOUNDARY CONDITIONS
**
** Name: BC-1 Type: Temperature
*Boundary
 fix, 1, 3
*Temperature, file=heattransfer_dc3d8.odb, interpolate
*Field,file=piezoelectric_c3d8e.odb, variable=2, output variable=epot, bstep=2, interpolate
**
** OUTPUT REQUESTS
**
*Restart, write, frequency=0
**
** FIELD OUTPUT: F-Output-1
**
*Output, field
*Element output
 TEMP, FV2, S
*Output, history, frequency=0
*End Step