*HEADING
 Transfer from Standard to Standard: elastic+plastic
 Dynamic->Dynamic transfer
 - First Standard analysis
*RESTART,WRITE
*NODE,NSET=ALL
*NSET,NSET=DISP
*ELEMENT,TYPE=S3R,ELSET=ONE
*SHELL SECTION,ELSET=ONE,MATERIAL=MAT1
1.0,
*MATERIAL,NAME=MAT1
*ELASTIC
200.E9,0.3
*PLASTIC
300.E6,0.0
350.E6,0.1
*DENSITY
7800.0
*STEP,NLGEOM
*DYNAMIC
0.01,0.1
*BOUNDARY,TYPE=VELOCITY
1,1,6
2,1,4
DISP,2,2
DISP,1,1,1.0
*EL FILE
S,
EE,
PE,
*NODE FILE
COORD,
*OUTPUT,FIELD,VARIABLE=PRESELECT,FREQ=1
*ELEMENT OUTPUT
S,
EE,
PE,
*NODE OUTPUT
COORD,
*END STEP
*STEP,NLGEOM
*DYNAMIC
0.01,0.1
*BOUNDARY,TYPE=VELOCITY
1,1,6
2,1,4
DISP,2,2
DISP,1,1,1.0
*EL FILE
S,
EE,
LE,
PE,
*NODE FILE
COORD,
*END STEP