*HEADING
std-std testing: transfer of temperatures
*RESTART,WRITE
*NODE,NSET=ALL
*NSET,NSET=BOT
*NSET,NSET=RIGHT
*NSET,NSET=LEFT
*NSET,NSET=TOP
*ELEMENT,TYPE=CPS6MT, ELSET=EALL
*SOLID SECTION,MATERIAL=A1, ELSET=EALL
*PHYSICAL CONSTANTS, ABSOLUTE ZERO=-273.0, STEFAN BOLTZMANN=5.0E-8
*MATERIAL,NAME=A1
*ELASTIC
2.E11,0.3
*PLASTIC
200.E8,0.0,0.0
250.E8,0.1,0.0
300.E8,0.15,0.0
150.E8,0.0,200.0
200.E8,0.1,200.0
250.E8,0.15,200.0
*EXPANSION
10.0E-6,
*CONDUCTIVITY
50.,
*DENSITY
7800.,
*SPECIFIC HEAT
450.0
*INITIAL CONDITIONS, TYPE=TEMPERATURE
ALL,25.0
*FILE FORMAT, ZERO INC
*STEP,NLGEOM,INC=20
*COUPLED TEMPERATURE-DISPLACEMENT
 0.1,1.0
*BOUNDARY
 LEFT,1,2
 BOT,2,2
 BOT,11,11
 TOP,11,11,50.0
*CLOAD
 RIGHT,1,1.E7
*ENERGY FILE
*OUTPUT,HISTORY,FREQUENCY=1
*ENERGY OUTPUT,VARIABLE=PRESELECT
*EL FILE
 S,EE,PE,THE
*OUTPUT,FIELD
*ELEMENT OUTPUT
 S,EE,PE,THE
*NODE OUTPUT
 NT,U
*NODE FILE
 RF,
 NT,
 RFL,
 U,
 COORD,
*OUTPUT,FIELD
*NODE OUTPUT
RF,
NT,
RFL,
COORD,
*END STEP