*HEADING
Std-std import: testing transfer of field variables and
temperatures. CPE4R
*PREPRINT,ECHO=YES,HISTORY=NO,MODEL=NO
*restart,write
*NODE,NSET=N1
*NODE,NSET=N2
*NSET,NSET=ALL
N1,N2
*ELEMENT,TYPE=CPS4R, ELSET=E1
*ELEMENT,TYPE=CPS4R, ELSET=E2
*SOLID SECTION,MATERIAL=A1, ELSET=E1,ORIENTATION=LOCAL
*SOLID SECTION,MATERIAL=A1, ELSET=E2,ORIENTATION=LOCAL
*MATERIAL,NAME=A1
*ELASTIC,DEPENDENCIES=1
3.0E11,0.3,-100.0,0.0
2.5E11,0.3,0.0,0.0
2.0E11,0.3,100.0,0.0
1.5E11,0.3,200.0,0.0
4.0E11,0.3,-100.0,30.0
3.5E11,0.3,0.0,30.0
3.0E11,0.3,100.0,30.0
2.5E11,0.3,200.0,30.0
*PLASTIC,DEPENDENCIES=1
200.E8,0.0,-100.0,0.0
150.E8,0.1,-100.0,0.0
200.E8,0.2,-100.0,0.0
150.E8,0.0,0.0,0.0
200.E8,0.1,0.0,0.0
250.E8,0.2,0.0,0.0
100.E8,0.0,100.0,0.0
150.E8,0.1,100.0,0.0
**
*EXPANSION,TYPE=ORTHO,ZERO=0
0.001,0.0002,0.0003
*DENSITY
7800.0,
*ORIENTATION,NAME=LOCAL
*INITIAL CONDITIONS,TYPE=TEMPERATURE
N1,-10.
N2,-10.
*INITIAL CONDITIONS,TYPE=FIELD, VARIABLE=1
N1,5.0
N2,5.0
*BOUNDARY
ALL,1,2
*FILE FORMAT, ZERO INC
*STEP,NLGEOM
*STATIC
0.1,1.0
*TEMPERATURE
N1, 70.,
N2, 70.,
*FIELD,VARIABLE=1
N1,10.0,
N2,10.0,
**-------------------------
*OUTPUT,HISTORY,FREQUENCY=1
*ENERGY OUTPUT,VARIABLE=PRESELECT
*OUTPUT,FIELD,VARIABLE=PRESELECT
*NODE OUTPUT
RF,
NT,
*EL PRINT
 LOADS,
*EL FILE
 LOADS,
*OUTPUT,FIELD
*ELEMENT OUTPUT
 THE,
 S,
 LE,
 PE,
*NODE PRINT
 RF,
*EL FILE
S,
THE,
LE,
EE,
FV,
PE,
SINV,
*NODE FILE
NT,
*END STEP