*HEADING
 Transfer from Standard to Standard: elastic+plastic
 - First Standard analysis
*RESTART,WRITE
*NODE,NSET=ALL
*NSET,NSET=DISP
*NSET,NSET=DISP1
*ELEMENT,TYPE=CPE6H,ELSET=EALL
*SOLID SECTION,ELSET=EALL,MATERIAL=MAT1
1.0,
*MATERIAL,NAME=MAT1
*ELASTIC
200.E9,0.3
*PLASTIC
300.E8,0.0
350.E8,0.1
*STEP,NLGEOM
*STATIC
.1,1.
*BOUNDARY
1,1,2
2,2,2
5,2,2
4,1,1
8,1,1
11,1,2
12,2,2
15,2,2
DISP,1,1,-0.2
DISP1,1,1,-0.1
*EL FILE
S,
EE,
PE,
*NODE FILE
COORD,
*OUTPUT,FIELD,VARIABLE=PRESELECT
*ELEMENT OUTPUT
S,
EE,
PE,
*NODE OUTPUT
COORD
*END STEP
*STEP,NLGEOM
*STATIC
.1,1.
*BOUNDARY, OP=MOD
DISP1,1,1,-0.2
*EL FILE
S,
EE,
LE,
PE,
*NODE FILE
COORD,
*END STEP