*HEADING
 Transfer from Standard to Standard: elastic+plastic
 - First Standard analysis
*RESTART,WRITE
*NODE,NSET=ALL
*NSET,NSET=DISP
*NSET,NSET=DISP1
**
*NSET,NSET=YZPLANE1
*NSET,NSET=YZPLANE2
*NSET,NSET=YZPLANE
YZPLANE1,YZPLANE2
**
*NSET,NSET=XZPLANE1
*NSET,NSET=XZPLANE2
*NSET,NSET=XZPLANE
XZPLANE1,XZPLANE2
**
*NSET,NSET=XYPLANE1
*NSET,NSET=XYPLANE2
*NSET,NSET=XYPLANE
XYPLANE1,XYPLANE2
**
*ELEMENT,TYPE=C3D4,ELSET=EALL
*SOLID SECTION,ELSET=EALL,MATERIAL=MAT1
1.0,
*MATERIAL,NAME=MAT1
*ELASTIC
200.E9,0.3
*PLASTIC
300.E8,0.0
350.E8,0.1
*STEP,NLGEOM
*STATIC
.1,1.
*BOUNDARY
XYPLANE,3,3
YZPLANE,1,1
XZPLANE,2,2
DISP,1,1,-0.2
DISP1,1,1,-0.1
*EL FILE
S,
EE,
PE,
*NODE FILE
COORD,
*OUTPUT,FIELD,VARIABLE=PRESELECT
*ELEMENT OUTPUT
S,
EE,
PE,
*NODE OUTPUT
COORD
*END STEP
*STEP,NLGEOM
*STATIC
.1,1.
*BOUNDARY, OP=MOD
DISP1,1,1,-0.2
*EL FILE
S,
EE,
LE,
PE,
*NODE FILE
COORD,
*END STEP