*HEADING
**Verification of periodic type sym. model generation
**Base problem for smg_period_open2 and smg_period_close2
**C3D8 and S4 elements
*preprint,model=yes,history=yes,contact=yes
*restart,write,freq=999
*NODE,NSET=NALL
*NSET, GEN, UNSORT, NSET=INNER
*NSET, GEN, UNSORT, NSET=BOT
*NSET, GEN, UNSORT, NSET=LEFT
*NSET, GEN, UNSORT, NSET=RIGHT
*ELEMENT,TYPE=C3D8,ELSET=DISK
*ELEMENT,TYPE=C3D8,ELSET=PAD
*element,type=s4,elset=horiz-1
*element,type=s4,elset=horiz-2
*element,type=s4,elset=vert-1
*element,type=s4,elset=vert-2
*elset,elset=shell1
horiz-1,horiz-2
*elset,elset=shell2
vert-1,vert-2
*elset,elset=shell
shell1,shell2
*embedded element,host elset=disk
shell,
*shell section,elset=shell1,material=steel,orientation=oraxi2
0.017,3
*shell section,elset=shell2,material=steel,orientation=oraxi
0.017,3
*NSET,NSET=PADTOP
*NSET,NSET=PADBOUN
*ELSET, GEN, ELSET=ONE
*ELSET, GEN, ELSET=ELOAD
*ELSET,ELSET=PRINT,GENERATE
*SOLID SECTION,ELSET= DISK,MATERIA= STEEL,ORIENTA= ORAXI
*MATERIAL,NAME= STEEL
*ELASTIC
70000,0.33
*plastic,hardening=kinematic
62,0
595.5,0.25
*EXPANSION
11.E-6,
*DENSITY
7800.,
*conductivity
50.
*specific heat
460.
*SOLID SECTION,ELSET=PAD,MATERIAL=STEEL2,ORIENTA= ORAXI
*MATERIAL, NAME=STEEL2
*ELASTIC
7.0E3,0.33
*plastic,hardening=kinematic
62,0
595.5,0.25
*EXPANSION
11.E-6,
*DENSITY
7800.,
*conductivity
50.
*specific heat
460.
*ORIENTATION      ,SYS=CYLI,NAME= ORAXI
*ORIENTATION      ,SYS=CYLI,NAME= ORAXI2
*SURFACE,NAME=DISK
ELOAD,S5
*SURFACE,NAME=PAD
PAD,S1
*SURFACE,NAME=syma4
210,s6
211,s6
212,s6
*SURFACE,NAME=symb4
213,s4
214,s4
215,s4
*SURFACE,NAME=syma
1,s2
2,s2
3,s2
4,s2
5,s2
6,s2
7,s2
8,s2
9,s2
*SURFACE,NAME=symb
201,s1
202,s1
203,s1
204,s1
205,s1
206,s1
207,s1
208,s1
209,s1
*SURFACE,name=syma1
1,s2
2,s2
3,s2
4,s2
*SURFACE,name=syma2
5,s2
6,s2
7,s2
*SURFACE,name=syma3
8,s2
9,s2
*SURFACE,name=symb1
201,s1
202,s1
203,s1
204,s1
*SURFACE,name=symb2
205,s1
206,s1
207,s1
*SURFACE,name=symb3
208,s1
209,s1
*CONTACT PAIR, SMALL SLIDING, INTERACTION=DISK_PAD
PAD,DISK
*SURFACE INTERACTION,NAME=DISK_PAD
*FRICTION
 0
***BOUNDARY
**bot,1,3
**padboun,1,1
**padboun,2,2
*TRANSFORM,NSET=NALL,TYPE=C
*initial conditions,type=temperature
nall,20.0
*BOUNDARY
bot,1,3
padboun,1,1
padboun,2,2
*STEP,nlgeom
*static
0.01,1
*boundary
padtop,3,3,-1.0E-3
**boundary
*output,field,var=preselect
*nset,nset=qa_test_padtop
padtop,
*elset,elset=qa_test_eload
eload,
*elset,elset=qa_test_print
print,
*elset,elset=qa_test_shell
**nset,nset=qa_test_nset
**nall,
*output,field,freq=999
*node output,nset=qa_test_padtop
u
*element output,elset=qa_test_eload
s,
e,
*element output,elset=qa_test_shell
s,
*END STEP