*HEADING
SIMPLY SUPPORTED PLATE WITH UNIFORM PRESSURE--- S3R 4 X 4 MESH 60 DEG
*PREPRINT,ECHO=YES,MODEL=NO,HISTORY=NO
*RESTART,TIMEMARKS=YES,WRITE,NUMBER INTERVAL=1
*NODE, NSET=CORNERS
*NGEN,NSET=BOT
*NGEN,NSET=TOP
*NFILL
BOT,TOP,8,100
*ELEMENT, TYPE=S3R
*NSET,NSET=SIDES,GEN
*NSET,NSET=LFTRT
*NSET,NSET=CENTND
*NSET,NSET=TOPBOT
*ELGEN,ELSET=ALLELS
*ELSET,ELSET=CENTER
*SHELL SECTION,MATERIAL=A1,ELSET=ALLELS,SECTION INTEGRATION=GAUSS
.01,
*MATERIAL,NAME=A1
*ELASTIC
3.E7,  .3
*DENSITY
3.0E3,
*BOUNDARY
SIDES,1,3
*STEP
*DYNAMIC, EXPLICIT
 ,10.0
*DLOAD
ALLELS,VP,3400.0
ALLELS,P,-1.
***OUTPUT,HISTORY,TIME INTERVAL=0.01
***NODE OUTPUT,NSET=CENTND
**U,
***ELEMENT OUTPUT,ELSET=CENTER
**SF,
***ENERGY OUTPUT
**ALLKE,ALLIE,ALLSE,ALLAE,ALLVD,ALLCD,ALLPD,ALLFD,ALLWK,ETOTAL,DT
*OUTPUT,FIELD,VAR=PRESELECT,NUMBER INTERVAL=5
**
** Output requests for qa testing
**
*NSET,NSET=QA_TEST
CENTND,
*FILE OUTPUT,NUMBER INTERVAL=1
*NODE FILE,NSET=CENTND
U,
*OUTPUT, FIELD, NUMBER INTERVAL=1
*NODE OUTPUT, NSET=QA_TEST
U,
*OUTPUT, HISTORY, VAR=PRESELECT, TIME INTERVAL=10.0
*END STEP