*HEADING
 RING BUCKLE EIGENVALUE ESTIMATE  1 - CAXA82
*NODE
*NGEN
*ELEMENT,TYPE=CAXA82,OFFSET=200,ELSET=ALL
*ELSET,ELSET=ALL
*SOLID SECTION,MATERIAL=MAT,ELSET=ALL
*MATERIAL,NAME=MAT
*ELASTIC
 30.0E6,0.0
*NSET,NSET=NALL,GENERATE
*EQUATION
*BOUNDARY
 NALL,2
*STEP
*BUCKLE
 2,
*DLOAD
 ALL,P3,1.0
*EL PRINT,FREQUENCY=0
*NODE PRINT ,SUMMARY=NO
U,RF
*MODAL PRINT
*MODAL FILE
*OUTPUT,HISTORY,FREQUENCY=1
*MODAL OUTPUT
*END STEP